{"text_format":"1","workbook":"xlsx","n_sheets":13,"sheets":["Cover","Code>","Preamble","Rename","Clean","Annualize","TAXSIM","Inputs>","Time Units","Indicators","Error Codes","Variables","Lookup"],"not_rendered":{"charts":0,"images":0,"macros":1,"external_links":0,"defined_names":17,"comments":0,"pivot_tables":0},"unopened":[],"bounds":{"document_bytes":16777216,"sheet_cells":100000,"rows_first":2000,"rows_last":500,"rows_between":2000,"halvings":0,"cell_chars":16384,"cell_head_chars":4096},"cells_cut":0,"cells_raw":0,"read":"whole","date_system":"1900"}

{"sheet":"Cover","index":0,"n_rows":27,"n_cols":8,"rows_kept":27,"cut":false,"hidden":false,"merged":[[12,7,14,7],[12,6,13,6],[9,1,10,4],[5,7,6,7],[8,7,9,7],[5,6,6,6],[8,6,9,6],[10,7,11,7],[10,6,11,6],[3,1,8,4]]}
[]
[]
[null,"Instructions",null,null,null,null,"Table of Contents"]
[null,"This file is designed to generate Stata code which evaluates the tax liability of PSID families using taxsim9. In order to run the code generated in this file, you will need to have taxsim9 installed in Stata and a .dta file of PSID family variables for the survey year (adjustable below). The PSID data should have the original PSID data names; otherwise you will need to update the data names in the Variables tab. Prior to extracting the code, specify below the PSID data year you are using, the name of the data file,  and where you want to store code. Other adjustable options are also included below. Once your file preferences and locations are specified you can generate a .txt file with the complete code included by pressing the \"Generate Code\" button below. To make the .txt file stata compatible you will need to change the extension to .do. The code will rename and clean the data, prepare TAXSIM inputs, and call taxsim9 in Stata.",null,null,null,null,"Tab Name","Description"]
[null,null,null,null,null,null,"Code Tabs"]
[null,null,null,null,null,null,"Preamble","Generates code preamble, including file settings and locations."]
[]
[null,null,null,null,null,null,"Rename","Generates code to rename PSID variables as TAXSIM-recognized variables"]
[null,null,null,null,null,null,"Clean","Generates code to replace values according to error codes"]
[null,"This code should run if the entire family data file is downloaded for any given year. However, if you have excluded variables you can indicate their omission by putting an \"N\" in the \"Included?\" column of Variables."]
[null,null,null,null,null,null,"Annualize","Generates code to standardize time unit variables, so they are all annual values"]
[]
[null,"Inputs",null,null,null,null,"TAXSIM","Produces code which: (1) converts cleaned variables into TAXSIM-readable inputs and (2) runs TAXSIM using taxsim9"]
[null,"Survey year",1968,null,"* Year data recorded in PSID; based on responses TAXSIM will calculate taxes for the prior year"]
[null,"Data saved as","Input Data Name.dta",null,"*Must be saved as a stata-data file ending with .dta; should include original PSID names"]
[null,"Data location","Input Data Location",null,null,null,"Input Tabs"]
[null,"Code location†","Input Code Location (.txt will be added here)",null,null,null,"Lookup","Contains reference lists"]
[null,"Calculate state taxes?","Yes",null,"* State taxes cannot be calculated before 1977",null,"Variables","Maps variables by PSID question across years"]
[null,"Drop variables not used by TAXSIM?","Yes",null,"* Will retain the family ID variable in both cases for merging with other data sets",null,"Error Codes","Contains error codes for included PSID variables"]
[null,"Include property tax estimates?","No",null,null,null,"Indicators","Maps values for indicator variables"]
[null,"Full TAXSIM output?","Yes",null,"* If set to \"Yes\" taxsim9 will report intermediate TAXSIM variables (e.g., taxable income)",null,"Time Units","Maps time unit multipliers"]
[]
[null,"† Code will not generate without a specified code location"]
[null,"Notes and Assumptions"]
[null,"* This code was written to get best estimate possible for any year, not for continuity across years"]
[null,"* This code does not incorporate or rely on PSID accuracy codes"]
[null,"* Note: state taxes may affect federal taxes through the state and local tax deduction"]

{"sheet":"Code>","index":1,"n_rows":0,"n_cols":0,"rows_kept":0,"cut":false,"hidden":false,"merged":[]}

{"sheet":"Preamble","index":2,"n_rows":49,"n_cols":4,"rows_kept":49,"cut":false,"hidden":false,"merged":[]}
[]
[null,"File Preamble (Stata Code)",null,"Additional Dividers"]
[]
[null,"****************************************************************************************************",null,"*** Drop Variables Not Used by TAXSIM"]
[null,{"$f":"CONCATENATE(\"* Annual TAXSIM Calculator for PSID Data: \",Cover!$C$14)","v":"* Annual TAXSIM Calculator for PSID Data: 1968"},null,{"$f":"IF(Cover!$C$19=\"YES\",\"capture drop V*\",\"* Drop of unused variables not selected\")","v":"capture drop V*"}]
[null,"* Authors: Margaret McKeehan and Nick Frazier",null,{"$f":"IF(Cover!$C$19=\"YES\",\"capture drop ER*\",\"* Drop of unused variables not selected\")","v":"capture drop ER*"}]
[null,"* "]
[null,{"$f":"CONCATENATE(\"* Uses Family Public Data for \",Survey_Year)","v":"* Uses Family Public Data for 1968"},null,"****************************************************************************************************"]
[null,"* Must specify file name and location below",null,"* Section 3: Annualize Data"]
[null,"****************************************************************************************************",null,"****************************************************************************************************"]
[null,null,null,"* Note: No Data Annualization Required Before 1983"]
[null,"****************************************************************************************************"]
[null,"* Notes and Assumptions"]
[null,"****************************************************************************************************"]
[null,"*This code uses the year before the date of the interview as the tax year to be consistent with"]
[null,"*     the PSID's practice of having respondents report their income and other financial values "]
[null,"*     for the prior year. Certain demographic variables, like location and marital status, indicate"]
[null,"*     the respondent's status at the time of interview and so are assumed to be the same as the"]
[null,"*      previous year. Users for whom this assumption is important are warned that the survey becomes "]
[null,"*     biennial after 1997 which complicates reconciliation."]
[null,"*"]
[null,{"$f":"Cover!B25","v":"* This code was written to get best estimate possible for any year, not for continuity across years"}]
[null,{"$f":"Cover!B26","v":"* This code does not incorporate or rely on PSID accuracy codes"}]
[null,{"$f":"Cover!B27","v":"* Note: state taxes may affect federal taxes through the state and local tax deduction"}]
[null,"* All non-wage, non-pension income is treated as \"other property income\" - dividends are not"]
[null,"*     separated out."]
[null,"****************************************************************************************************"]
[]
[null,"****************************************************************************************************"]
[null,"* Section 1: File Preamble"]
[null,"****************************************************************************************************"]
[null,"*** Basic File Setup"]
[null,"capture clear all"]
[null,"set more off"]
[]
[null,"*** Set Run Parameters"]
[null,{"$f":"CONCATENATE(\"local CALC_STATE_TAX = \",IF(Cover!C18=\"YES\",1,0))","v":"local CALC_STATE_TAX = 1"}]
[null,{"$f":"CONCATENATE(\"local INCLUDE_PROP_TAX = \",IF(Cover!C20=\"Yes\",1,0))","v":"local INCLUDE_PROP_TAX = 0"}]
[]
[null,"*** Store File Locations"]
[null,{"$f":"CONCATENATE(\"local datacd \",CHAR(34),Cover!$C$16,CHAR(34))","v":"local datacd \"Input Data Location\""}]
[]
[null,"*** Load Data"]
[null,{"$f":"CONCATENATE(\"local dataname =\",CHAR(34),\"`datacd'\",CHAR(34),\" + \",CHAR(34),\"\\\",CHAR(34),\" + \",CHAR(34),Cover!$C$15,CHAR(34))","v":"local dataname =\"`datacd'\" + \"\\\" + \"Input Data Name.dta\""}]
[null,"use \"`dataname'\""]
[]
[null,"****************************************************************************************************"]
[null,"* Section 2: Rename and Clean Variables"]
[null,"****************************************************************************************************"]

{"sheet":"Rename","index":3,"n_rows":103,"n_cols":10,"rows_kept":103,"cut":false,"hidden":false,"merged":[[1,3,1,9]]}
[]
[null,"Rename Variables (Stata Code)",null,"Input Calculations"]
[null,{"$f":"CONCATENATE(\"*** Rename \",Cover!$C$14,\" Variables\")","v":"*** Rename 1968 Variables"}," ","ID","Variable","PSID ID","Use?","Count","Var","Tag"]
[null,{"$f":"IF($I4=\"\",\"\",CONCATENATE(\"rename \",TRIM($I4),\" \",$J4,\"_\",Cover!$C$14,\", replace\"))","v":"rename V117 age1_1968, replace"},null,1,{"$f":"IF(Variables!E3=\"\",\"\",Variables!E3)","v":"age1"},{"$f":"IFERROR(INDEX(Variables!$B:$BY,MATCH($E4,Variables!$E:$E,0),MATCH(Cover!$C$14,Variables!$B$2:$BY$2,0)),\"\")","v":"V117"},{"$f":"IF(E4=\"\",\"\",IF(F4=\"-\",\"N\",INDEX(Variables!$B:$BY,MATCH(E4,Variables!$E:$E,0),MATCH(\"Included?\",Variables!$B$2:$BY$2,0))))","v":"Y"},{"$f":"IF(G4=\"\",\"\",COUNTIF($G$4:G4,\"Y\"))","v":1},{"$f":"IFERROR(TRIM(INDEX($F:$F,MATCH($D4,$H:$H,0),1)),\"\")","v":"V117"},{"$f":"IFERROR(TRIM(INDEX($E:$E,MATCH($I4,$F:$F,0),1)),\"\")","v":"age1"}]
[null,{"$f":"IF($I5=\"\",\"\",CONCATENATE(\"rename \",TRIM($I5),\" \",$J5,\"_\",Cover!$C$14,\", replace\"))","v":"rename V118 age2_1968, replace"}," ",2,{"$f":"IF(Variables!E4=\"\",\"\",Variables!E4)","v":"age2"},{"$f":"IFERROR(INDEX(Variables!$B:$BY,MATCH($E5,Variables!$E:$E,0),MATCH(Cover!$C$14,Variables!$B$2:$BY$2,0)),\"\")","v":"V118"},{"$f":"IF(E5=\"\",\"\",IF(F5=\"-\",\"N\",INDEX(Variables!$B:$BY,MATCH(E5,Variables!$E:$E,0),MATCH(\"Included?\",Variables!$B$2:$BY$2,0))))","v":"Y"},{"$f":"IF(G5=\"\",\"\",COUNTIF($G$4:G5,\"Y\"))","v":2},{"$f":"IFERROR(TRIM(INDEX($F:$F,MATCH($D5,$H:$H,0),1)),\"\")","v":"V118"},{"$f":"IFERROR(TRIM(INDEX($E:$E,MATCH($I5,$F:$F,0),1)),\"\")","v":"age2"}]
[null,{"$f":"IF($I6=\"\",\"\",CONCATENATE(\"rename \",TRIM($I6),\" \",$J6,\"_\",Cover!$C$14,\", replace\"))","v":"rename V3 family_ID1_1968, replace"},null,3,{"$f":"IF(Variables!E5=\"\",\"\",Variables!E5)","v":"childcare1"},{"$f":"IFERROR(INDEX(Variables!$B:$BY,MATCH($E6,Variables!$E:$E,0),MATCH(Cover!$C$14,Variables!$B$2:$BY$2,0)),\"\")","v":"-"},{"$f":"IF(E6=\"\",\"\",IF(F6=\"-\",\"N\",INDEX(Variables!$B:$BY,MATCH(E6,Variables!$E:$E,0),MATCH(\"Included?\",Variables!$B$2:$BY$2,0))))","v":"N"},{"$f":"IF(G6=\"\",\"\",COUNTIF($G$4:G6,\"Y\"))","v":2},"V3","family_ID1"]
[null,{"$f":"IF($I7=\"\",\"\",CONCATENATE(\"rename \",TRIM($I7),\" \",$J7,\"_\",Cover!$C$14,\", replace\"))","v":"rename V76 tax_inc1_1968, replace"},null,4,{"$f":"IF(Variables!E6=\"\",\"\",Variables!E6)","v":"childcare1_TU"},{"$f":"IFERROR(INDEX(Variables!$B:$BY,MATCH($E7,Variables!$E:$E,0),MATCH(Cover!$C$14,Variables!$B$2:$BY$2,0)),\"\")","v":"-"},{"$f":"IF(E7=\"\",\"\",IF(F7=\"-\",\"N\",INDEX(Variables!$B:$BY,MATCH(E7,Variables!$E:$E,0),MATCH(\"Included?\",Variables!$B$2:$BY$2,0))))","v":"N"},{"$f":"IF(G7=\"\",\"\",COUNTIF($G$4:G7,\"Y\"))","v":2},"V76","tax_inc1"]
[null,{"$f":"IF($I8=\"\",\"\",CONCATENATE(\"rename \",TRIM($I8),\" \",$J8,\"_\",Cover!$C$14,\", replace\"))","v":"rename V239 mstat2_1968, replace"},null,5,{"$f":"IF(Variables!E7=\"\",\"\",Variables!E7)","v":"deduction1"},{"$f":"IFERROR(INDEX(Variables!$B:$BY,MATCH($E8,Variables!$E:$E,0),MATCH(Cover!$C$14,Variables!$B$2:$BY$2,0)),\"\")","v":"-"},{"$f":"IF(E8=\"\",\"\",IF(F8=\"-\",\"N\",INDEX(Variables!$B:$BY,MATCH(E8,Variables!$E:$E,0),MATCH(\"Included?\",Variables!$B$2:$BY$2,0))))","v":"N"},{"$f":"IF(G8=\"\",\"\",COUNTIF($G$4:G8,\"Y\"))","v":2},"V239","mstat2"]
[null,{"$f":"IF($I9=\"\",\"\",CONCATENATE(\"rename \",TRIM($I9),\" \",$J9,\"_\",Cover!$C$14,\", replace\"))","v":"rename V398 num_dep2_1968, replace"},null,6,{"$f":"IF(Variables!E8=\"\",\"\",Variables!E8)","v":"deduction2"},{"$f":"IFERROR(INDEX(Variables!$B:$BY,MATCH($E9,Variables!$E:$E,0),MATCH(Cover!$C$14,Variables!$B$2:$BY$2,0)),\"\")","v":"-"},{"$f":"IF(E9=\"\",\"\",IF(F9=\"-\",\"N\",INDEX(Variables!$B:$BY,MATCH(E9,Variables!$E:$E,0),MATCH(\"Included?\",Variables!$B$2:$BY$2,0))))","v":"N"},{"$f":"IF(G9=\"\",\"\",COUNTIF($G$4:G9,\"Y\"))","v":2},"V398","num_dep2"]
[null,{"$f":"IF($I10=\"\",\"\",CONCATENATE(\"rename \",TRIM($I10),\" \",$J10,\"_\",Cover!$C$14,\", replace\"))","v":"rename V278 num_dep3_1968, replace"},null,7,{"$f":"IF(Variables!E9=\"\",\"\",Variables!E9)","v":"family_ID1"},{"$f":"IFERROR(INDEX(Variables!$B:$BY,MATCH($E10,Variables!$E:$E,0),MATCH(Cover!$C$14,Variables!$B$2:$BY$2,0)),\"\")","v":"V3"},{"$f":"IF(E10=\"\",\"\",IF(F10=\"-\",\"N\",INDEX(Variables!$B:$BY,MATCH(E10,Variables!$E:$E,0),MATCH(\"Included?\",Variables!$B$2:$BY$2,0))))","v":"Y"},{"$f":"IF(G10=\"\",\"\",COUNTIF($G$4:G10,\"Y\"))","v":3},"V278","num_dep3"]
[null,{"$f":"IF($I11=\"\",\"\",CONCATENATE(\"rename \",TRIM($I11),\" \",$J11,\"_\",Cover!$C$14,\", replace\"))","v":"rename V6 prop_tax1_1968, replace"},null,8,{"$f":"IF(Variables!E10=\"\",\"\",Variables!E10)","v":"tax_inc1"},{"$f":"IFERROR(INDEX(Variables!$B:$BY,MATCH($E11,Variables!$E:$E,0),MATCH(Cover!$C$14,Variables!$B$2:$BY$2,0)),\"\")","v":"V76"},{"$f":"IF(E11=\"\",\"\",IF(F11=\"-\",\"N\",INDEX(Variables!$B:$BY,MATCH(E11,Variables!$E:$E,0),MATCH(\"Included?\",Variables!$B$2:$BY$2,0))))","v":"Y"},{"$f":"IF(G11=\"\",\"\",COUNTIF($G$4:G11,\"Y\"))","v":4},"V6","prop_tax1"]
[null,{"$f":"IF($I12=\"\",\"\",CONCATENATE(\"rename \",TRIM($I12),\" \",$J12,\"_\",Cover!$C$14,\", replace\"))","v":"rename V10 rent1_1968, replace"},null,9,{"$f":"IF(Variables!E11=\"\",\"\",Variables!E11)","v":"gssi1"},{"$f":"IFERROR(INDEX(Variables!$B:$BY,MATCH($E12,Variables!$E:$E,0),MATCH(Cover!$C$14,Variables!$B$2:$BY$2,0)),\"\")","v":"-"},{"$f":"IF(E12=\"\",\"\",IF(F12=\"-\",\"N\",INDEX(Variables!$B:$BY,MATCH(E12,Variables!$E:$E,0),MATCH(\"Included?\",Variables!$B$2:$BY$2,0))))","v":"N"},{"$f":"IF(G12=\"\",\"\",COUNTIF($G$4:G12,\"Y\"))","v":4},"V10","rent1"]
[null,{"$f":"IF($I13=\"\",\"\",CONCATENATE(\"rename \",TRIM($I13),\" \",$J13,\"_\",Cover!$C$14,\", replace\"))","v":"rename V93 state1_1968, replace"},null,10,{"$f":"IF(Variables!E12=\"\",\"\",Variables!E12)","v":"gssi2"},{"$f":"IFERROR(INDEX(Variables!$B:$BY,MATCH($E13,Variables!$E:$E,0),MATCH(Cover!$C$14,Variables!$B$2:$BY$2,0)),\"\")","v":"-"},{"$f":"IF(E13=\"\",\"\",IF(F13=\"-\",\"N\",INDEX(Variables!$B:$BY,MATCH(E13,Variables!$E:$E,0),MATCH(\"Included?\",Variables!$B$2:$BY$2,0))))","v":"N"},{"$f":"IF(G13=\"\",\"\",COUNTIF($G$4:G13,\"Y\"))","v":4},"V93","state1"]
[null,{"$f":"IF($I14=\"\",\"\",CONCATENATE(\"rename \",TRIM($I14),\" \",$J14,\"_\",Cover!$C$14,\", replace\"))","v":"rename V74 wages1_1968, replace"},null,11,{"$f":"IF(Variables!E13=\"\",\"\",Variables!E13)","v":"gssi3"},{"$f":"IFERROR(INDEX(Variables!$B:$BY,MATCH($E14,Variables!$E:$E,0),MATCH(Cover!$C$14,Variables!$B$2:$BY$2,0)),\"\")","v":"-"},{"$f":"IF(E14=\"\",\"\",IF(F14=\"-\",\"N\",INDEX(Variables!$B:$BY,MATCH(E14,Variables!$E:$E,0),MATCH(\"Included?\",Variables!$B$2:$BY$2,0))))","v":"N"},{"$f":"IF(G14=\"\",\"\",COUNTIF($G$4:G14,\"Y\"))","v":4},"V74","wages1"]
[null,{"$f":"IF($I15=\"\",\"\",CONCATENATE(\"rename \",TRIM($I15),\" \",$J15,\"_\",Cover!$C$14,\", replace\"))","v":"rename V75 wages2_1968, replace"},null,12,{"$f":"IF(Variables!E14=\"\",\"\",Variables!E14)","v":"gssi4"},{"$f":"IFERROR(INDEX(Variables!$B:$BY,MATCH($E15,Variables!$E:$E,0),MATCH(Cover!$C$14,Variables!$B$2:$BY$2,0)),\"\")","v":"-"},{"$f":"IF(E15=\"\",\"\",IF(F15=\"-\",\"N\",INDEX(Variables!$B:$BY,MATCH(E15,Variables!$E:$E,0),MATCH(\"Included?\",Variables!$B$2:$BY$2,0))))","v":"N"},{"$f":"IF(G15=\"\",\"\",COUNTIF($G$4:G15,\"Y\"))","v":4},"V75","wages2"]
[null,{"$f":"IF($I16=\"\",\"\",CONCATENATE(\"rename \",TRIM($I16),\" \",$J16,\"_\",Cover!$C$14,\", replace\"))","v":""},null,13,{"$f":"IF(Variables!E15=\"\",\"\",Variables!E15)","v":"mstat1"},{"$f":"IFERROR(INDEX(Variables!$B:$BY,MATCH($E16,Variables!$E:$E,0),MATCH(Cover!$C$14,Variables!$B$2:$BY$2,0)),\"\")","v":"-"},{"$f":"IF(E16=\"\",\"\",IF(F16=\"-\",\"N\",INDEX(Variables!$B:$BY,MATCH(E16,Variables!$E:$E,0),MATCH(\"Included?\",Variables!$B$2:$BY$2,0))))","v":"N"},{"$f":"IF(G16=\"\",\"\",COUNTIF($G$4:G16,\"Y\"))","v":4},"",""]
[null,{"$f":"IF($I17=\"\",\"\",CONCATENATE(\"rename \",TRIM($I17),\" \",$J17,\"_\",Cover!$C$14,\", replace\"))","v":""},null,14,{"$f":"IF(Variables!E16=\"\",\"\",Variables!E16)","v":"mstat2"},{"$f":"IFERROR(INDEX(Variables!$B:$BY,MATCH($E17,Variables!$E:$E,0),MATCH(Cover!$C$14,Variables!$B$2:$BY$2,0)),\"\")","v":"V239"},{"$f":"IF(E17=\"\",\"\",IF(F17=\"-\",\"N\",INDEX(Variables!$B:$BY,MATCH(E17,Variables!$E:$E,0),MATCH(\"Included?\",Variables!$B$2:$BY$2,0))))","v":"Y"},{"$f":"IF(G17=\"\",\"\",COUNTIF($G$4:G17,\"Y\"))","v":5},"",""]
[null,{"$f":"IF($I18=\"\",\"\",CONCATENATE(\"rename \",TRIM($I18),\" \",$J18,\"_\",Cover!$C$14,\", replace\"))","v":""},null,15,{"$f":"IF(Variables!E17=\"\",\"\",Variables!E17)","v":"num_dep1"},{"$f":"IFERROR(INDEX(Variables!$B:$BY,MATCH($E18,Variables!$E:$E,0),MATCH(Cover!$C$14,Variables!$B$2:$BY$2,0)),\"\")","v":"-"},{"$f":"IF(E18=\"\",\"\",IF(F18=\"-\",\"N\",INDEX(Variables!$B:$BY,MATCH(E18,Variables!$E:$E,0),MATCH(\"Included?\",Variables!$B$2:$BY$2,0))))","v":"N"},{"$f":"IF(G18=\"\",\"\",COUNTIF($G$4:G18,\"Y\"))","v":5},"",""]
[null,{"$f":"IF($I19=\"\",\"\",CONCATENATE(\"rename \",TRIM($I19),\" \",$J19,\"_\",Cover!$C$14,\", replace\"))","v":""},null,16,{"$f":"IF(Variables!E18=\"\",\"\",Variables!E18)","v":"num_dep2"},{"$f":"IFERROR(INDEX(Variables!$B:$BY,MATCH($E19,Variables!$E:$E,0),MATCH(Cover!$C$14,Variables!$B$2:$BY$2,0)),\"\")","v":"V398"},{"$f":"IF(E19=\"\",\"\",IF(F19=\"-\",\"N\",INDEX(Variables!$B:$BY,MATCH(E19,Variables!$E:$E,0),MATCH(\"Included?\",Variables!$B$2:$BY$2,0))))","v":"Y"},{"$f":"IF(G19=\"\",\"\",COUNTIF($G$4:G19,\"Y\"))","v":6},"",""]
[null,{"$f":"IF($I20=\"\",\"\",CONCATENATE(\"rename \",TRIM($I20),\" \",$J20,\"_\",Cover!$C$14,\", replace\"))","v":""},null,17,{"$f":"IF(Variables!E19=\"\",\"\",Variables!E19)","v":"num_dep3"},{"$f":"IFERROR(INDEX(Variables!$B:$BY,MATCH($E20,Variables!$E:$E,0),MATCH(Cover!$C$14,Variables!$B$2:$BY$2,0)),\"\")","v":"V278"},{"$f":"IF(E20=\"\",\"\",IF(F20=\"-\",\"N\",INDEX(Variables!$B:$BY,MATCH(E20,Variables!$E:$E,0),MATCH(\"Included?\",Variables!$B$2:$BY$2,0))))","v":"Y"},{"$f":"IF(G20=\"\",\"\",COUNTIF($G$4:G20,\"Y\"))","v":7},"",""]
[null,{"$f":"IF($I21=\"\",\"\",CONCATENATE(\"rename \",TRIM($I21),\" \",$J21,\"_\",Cover!$C$14,\", replace\"))","v":""},null,18,{"$f":"IF(Variables!E20=\"\",\"\",Variables!E20)","v":"pension_inc1"},{"$f":"IFERROR(INDEX(Variables!$B:$BY,MATCH($E21,Variables!$E:$E,0),MATCH(Cover!$C$14,Variables!$B$2:$BY$2,0)),\"\")","v":"-"},{"$f":"IF(E21=\"\",\"\",IF(F21=\"-\",\"N\",INDEX(Variables!$B:$BY,MATCH(E21,Variables!$E:$E,0),MATCH(\"Included?\",Variables!$B$2:$BY$2,0))))","v":"N"},{"$f":"IF(G21=\"\",\"\",COUNTIF($G$4:G21,\"Y\"))","v":7},"",""]
[null,{"$f":"IF($I22=\"\",\"\",CONCATENATE(\"rename \",TRIM($I22),\" \",$J22,\"_\",Cover!$C$14,\", replace\"))","v":""},null,19,{"$f":"IF(Variables!E21=\"\",\"\",Variables!E21)","v":"pension_inc2"},{"$f":"IFERROR(INDEX(Variables!$B:$BY,MATCH($E22,Variables!$E:$E,0),MATCH(Cover!$C$14,Variables!$B$2:$BY$2,0)),\"\")","v":"-"},{"$f":"IF(E22=\"\",\"\",IF(F22=\"-\",\"N\",INDEX(Variables!$B:$BY,MATCH(E22,Variables!$E:$E,0),MATCH(\"Included?\",Variables!$B$2:$BY$2,0))))","v":"N"},{"$f":"IF(G22=\"\",\"\",COUNTIF($G$4:G22,\"Y\"))","v":7},"",""]
[null,{"$f":"IF($I23=\"\",\"\",CONCATENATE(\"rename \",TRIM($I23),\" \",$J23,\"_\",Cover!$C$14,\", replace\"))","v":""},null,20,{"$f":"IF(Variables!E22=\"\",\"\",Variables!E22)","v":"pension_inc3"},{"$f":"IFERROR(INDEX(Variables!$B:$BY,MATCH($E23,Variables!$E:$E,0),MATCH(Cover!$C$14,Variables!$B$2:$BY$2,0)),\"\")","v":"-"},{"$f":"IF(E23=\"\",\"\",IF(F23=\"-\",\"N\",INDEX(Variables!$B:$BY,MATCH(E23,Variables!$E:$E,0),MATCH(\"Included?\",Variables!$B$2:$BY$2,0))))","v":"N"},{"$f":"IF(G23=\"\",\"\",COUNTIF($G$4:G23,\"Y\"))","v":7},"",""]
[null,{"$f":"IF($I24=\"\",\"\",CONCATENATE(\"rename \",TRIM($I24),\" \",$J24,\"_\",Cover!$C$14,\", replace\"))","v":""},null,21,{"$f":"IF(Variables!E23=\"\",\"\",Variables!E23)","v":"pension_inc4"},{"$f":"IFERROR(INDEX(Variables!$B:$BY,MATCH($E24,Variables!$E:$E,0),MATCH(Cover!$C$14,Variables!$B$2:$BY$2,0)),\"\")","v":"-"},{"$f":"IF(E24=\"\",\"\",IF(F24=\"-\",\"N\",INDEX(Variables!$B:$BY,MATCH(E24,Variables!$E:$E,0),MATCH(\"Included?\",Variables!$B$2:$BY$2,0))))","v":"N"},{"$f":"IF(G24=\"\",\"\",COUNTIF($G$4:G24,\"Y\"))","v":7},"",""]
[null,{"$f":"IF($I25=\"\",\"\",CONCATENATE(\"rename \",TRIM($I25),\" \",$J25,\"_\",Cover!$C$14,\", replace\"))","v":""},null,22,{"$f":"IF(Variables!E24=\"\",\"\",Variables!E24)","v":"pension_inc5"},{"$f":"IFERROR(INDEX(Variables!$B:$BY,MATCH($E25,Variables!$E:$E,0),MATCH(Cover!$C$14,Variables!$B$2:$BY$2,0)),\"\")","v":"-"},{"$f":"IF(E25=\"\",\"\",IF(F25=\"-\",\"N\",INDEX(Variables!$B:$BY,MATCH(E25,Variables!$E:$E,0),MATCH(\"Included?\",Variables!$B$2:$BY$2,0))))","v":"N"},{"$f":"IF(G25=\"\",\"\",COUNTIF($G$4:G25,\"Y\"))","v":7},"",""]
[null,{"$f":"IF($I26=\"\",\"\",CONCATENATE(\"rename \",TRIM($I26),\" \",$J26,\"_\",Cover!$C$14,\", replace\"))","v":""},null,23,{"$f":"IF(Variables!E25=\"\",\"\",Variables!E25)","v":"pension_inc6"},{"$f":"IFERROR(INDEX(Variables!$B:$BY,MATCH($E26,Variables!$E:$E,0),MATCH(Cover!$C$14,Variables!$B$2:$BY$2,0)),\"\")","v":"-"},{"$f":"IF(E26=\"\",\"\",IF(F26=\"-\",\"N\",INDEX(Variables!$B:$BY,MATCH(E26,Variables!$E:$E,0),MATCH(\"Included?\",Variables!$B$2:$BY$2,0))))","v":"N"},{"$f":"IF(G26=\"\",\"\",COUNTIF($G$4:G26,\"Y\"))","v":7},"",""]
[null,{"$f":"IF($I27=\"\",\"\",CONCATENATE(\"rename \",TRIM($I27),\" \",$J27,\"_\",Cover!$C$14,\", replace\"))","v":""},null,24,{"$f":"IF(Variables!E26=\"\",\"\",Variables!E26)","v":"pension_inc6_TU"},{"$f":"IFERROR(INDEX(Variables!$B:$BY,MATCH($E27,Variables!$E:$E,0),MATCH(Cover!$C$14,Variables!$B$2:$BY$2,0)),\"\")","v":"-"},{"$f":"IF(E27=\"\",\"\",IF(F27=\"-\",\"N\",INDEX(Variables!$B:$BY,MATCH(E27,Variables!$E:$E,0),MATCH(\"Included?\",Variables!$B$2:$BY$2,0))))","v":"N"},{"$f":"IF(G27=\"\",\"\",COUNTIF($G$4:G27,\"Y\"))","v":7},"",""]
[null,{"$f":"IF($I28=\"\",\"\",CONCATENATE(\"rename \",TRIM($I28),\" \",$J28,\"_\",Cover!$C$14,\", replace\"))","v":""},null,25,{"$f":"IF(Variables!E27=\"\",\"\",Variables!E27)","v":"pension_inc8"},{"$f":"IFERROR(INDEX(Variables!$B:$BY,MATCH($E28,Variables!$E:$E,0),MATCH(Cover!$C$14,Variables!$B$2:$BY$2,0)),\"\")","v":"-"},{"$f":"IF(E28=\"\",\"\",IF(F28=\"-\",\"N\",INDEX(Variables!$B:$BY,MATCH(E28,Variables!$E:$E,0),MATCH(\"Included?\",Variables!$B$2:$BY$2,0))))","v":"N"},{"$f":"IF(G28=\"\",\"\",COUNTIF($G$4:G28,\"Y\"))","v":7},"",""]
[null,{"$f":"IF($I29=\"\",\"\",CONCATENATE(\"rename \",TRIM($I29),\" \",$J29,\"_\",Cover!$C$14,\", replace\"))","v":""},null,26,{"$f":"IF(Variables!E28=\"\",\"\",Variables!E28)","v":"pension_inc8_TU"},{"$f":"IFERROR(INDEX(Variables!$B:$BY,MATCH($E29,Variables!$E:$E,0),MATCH(Cover!$C$14,Variables!$B$2:$BY$2,0)),\"\")","v":"-"},{"$f":"IF(E29=\"\",\"\",IF(F29=\"-\",\"N\",INDEX(Variables!$B:$BY,MATCH(E29,Variables!$E:$E,0),MATCH(\"Included?\",Variables!$B$2:$BY$2,0))))","v":"N"},{"$f":"IF(G29=\"\",\"\",COUNTIF($G$4:G29,\"Y\"))","v":7},"",""]
[null,{"$f":"IF($I30=\"\",\"\",CONCATENATE(\"rename \",TRIM($I30),\" \",$J30,\"_\",Cover!$C$14,\", replace\"))","v":""},null,27,{"$f":"IF(Variables!E29=\"\",\"\",Variables!E29)","v":"prop_tax1"},{"$f":"IFERROR(INDEX(Variables!$B:$BY,MATCH($E30,Variables!$E:$E,0),MATCH(Cover!$C$14,Variables!$B$2:$BY$2,0)),\"\")","v":"V6"},{"$f":"IF(E30=\"\",\"\",IF(F30=\"-\",\"N\",INDEX(Variables!$B:$BY,MATCH(E30,Variables!$E:$E,0),MATCH(\"Included?\",Variables!$B$2:$BY$2,0))))","v":"Y"},{"$f":"IF(G30=\"\",\"\",COUNTIF($G$4:G30,\"Y\"))","v":8},"",""]
[null,{"$f":"IF($I31=\"\",\"\",CONCATENATE(\"rename \",TRIM($I31),\" \",$J31,\"_\",Cover!$C$14,\", replace\"))","v":""},null,28,{"$f":"IF(Variables!E30=\"\",\"\",Variables!E30)","v":"rent1"},{"$f":"IFERROR(INDEX(Variables!$B:$BY,MATCH($E31,Variables!$E:$E,0),MATCH(Cover!$C$14,Variables!$B$2:$BY$2,0)),\"\")","v":"V10"},{"$f":"IF(E31=\"\",\"\",IF(F31=\"-\",\"N\",INDEX(Variables!$B:$BY,MATCH(E31,Variables!$E:$E,0),MATCH(\"Included?\",Variables!$B$2:$BY$2,0))))","v":"Y"},{"$f":"IF(G31=\"\",\"\",COUNTIF($G$4:G31,\"Y\"))","v":9},"",""]
[null,{"$f":"IF($I32=\"\",\"\",CONCATENATE(\"rename \",TRIM($I32),\" \",$J32,\"_\",Cover!$C$14,\", replace\"))","v":""},null,29,{"$f":"IF(Variables!E31=\"\",\"\",Variables!E31)","v":"rent2"},{"$f":"IFERROR(INDEX(Variables!$B:$BY,MATCH($E32,Variables!$E:$E,0),MATCH(Cover!$C$14,Variables!$B$2:$BY$2,0)),\"\")","v":"-"},{"$f":"IF(E32=\"\",\"\",IF(F32=\"-\",\"N\",INDEX(Variables!$B:$BY,MATCH(E32,Variables!$E:$E,0),MATCH(\"Included?\",Variables!$B$2:$BY$2,0))))","v":"N"},{"$f":"IF(G32=\"\",\"\",COUNTIF($G$4:G32,\"Y\"))","v":9},"",""]
[null,{"$f":"IF($I33=\"\",\"\",CONCATENATE(\"rename \",TRIM($I33),\" \",$J33,\"_\",Cover!$C$14,\", replace\"))","v":""},null,30,{"$f":"IF(Variables!E32=\"\",\"\",Variables!E32)","v":"rent2_TU"},{"$f":"IFERROR(INDEX(Variables!$B:$BY,MATCH($E33,Variables!$E:$E,0),MATCH(Cover!$C$14,Variables!$B$2:$BY$2,0)),\"\")","v":"-"},{"$f":"IF(E33=\"\",\"\",IF(F33=\"-\",\"N\",INDEX(Variables!$B:$BY,MATCH(E33,Variables!$E:$E,0),MATCH(\"Included?\",Variables!$B$2:$BY$2,0))))","v":"N"},{"$f":"IF(G33=\"\",\"\",COUNTIF($G$4:G33,\"Y\"))","v":9},"",""]
[null,{"$f":"IF($I34=\"\",\"\",CONCATENATE(\"rename \",TRIM($I34),\" \",$J34,\"_\",Cover!$C$14,\", replace\"))","v":""},null,31,{"$f":"IF(Variables!E33=\"\",\"\",Variables!E33)","v":"state1"},{"$f":"IFERROR(INDEX(Variables!$B:$BY,MATCH($E34,Variables!$E:$E,0),MATCH(Cover!$C$14,Variables!$B$2:$BY$2,0)),\"\")","v":"V93"},{"$f":"IF(E34=\"\",\"\",IF(F34=\"-\",\"N\",INDEX(Variables!$B:$BY,MATCH(E34,Variables!$E:$E,0),MATCH(\"Included?\",Variables!$B$2:$BY$2,0))))","v":"Y"},{"$f":"IF(G34=\"\",\"\",COUNTIF($G$4:G34,\"Y\"))","v":10},"",""]
[null,{"$f":"IF($I35=\"\",\"\",CONCATENATE(\"rename \",TRIM($I35),\" \",$J35,\"_\",Cover!$C$14,\", replace\"))","v":""},null,32,{"$f":"IF(Variables!E34=\"\",\"\",Variables!E34)","v":"transfers1"},{"$f":"IFERROR(INDEX(Variables!$B:$BY,MATCH($E35,Variables!$E:$E,0),MATCH(Cover!$C$14,Variables!$B$2:$BY$2,0)),\"\")","v":"-"},{"$f":"IF(E35=\"\",\"\",IF(F35=\"-\",\"N\",INDEX(Variables!$B:$BY,MATCH(E35,Variables!$E:$E,0),MATCH(\"Included?\",Variables!$B$2:$BY$2,0))))","v":"N"},{"$f":"IF(G35=\"\",\"\",COUNTIF($G$4:G35,\"Y\"))","v":10},"",""]
[null,{"$f":"IF($I36=\"\",\"\",CONCATENATE(\"rename \",TRIM($I36),\" \",$J36,\"_\",Cover!$C$14,\", replace\"))","v":""},null,33,{"$f":"IF(Variables!E35=\"\",\"\",Variables!E35)","v":"unemp_inc1"},{"$f":"IFERROR(INDEX(Variables!$B:$BY,MATCH($E36,Variables!$E:$E,0),MATCH(Cover!$C$14,Variables!$B$2:$BY$2,0)),\"\")","v":"-"},{"$f":"IF(E36=\"\",\"\",IF(F36=\"-\",\"N\",INDEX(Variables!$B:$BY,MATCH(E36,Variables!$E:$E,0),MATCH(\"Included?\",Variables!$B$2:$BY$2,0))))","v":"N"},{"$f":"IF(G36=\"\",\"\",COUNTIF($G$4:G36,\"Y\"))","v":10},"",""]
[null,{"$f":"IF($I37=\"\",\"\",CONCATENATE(\"rename \",TRIM($I37),\" \",$J37,\"_\",Cover!$C$14,\", replace\"))","v":""},null,34,{"$f":"IF(Variables!E36=\"\",\"\",Variables!E36)","v":"unemp_inc2"},{"$f":"IFERROR(INDEX(Variables!$B:$BY,MATCH($E37,Variables!$E:$E,0),MATCH(Cover!$C$14,Variables!$B$2:$BY$2,0)),\"\")","v":"-"},{"$f":"IF(E37=\"\",\"\",IF(F37=\"-\",\"N\",INDEX(Variables!$B:$BY,MATCH(E37,Variables!$E:$E,0),MATCH(\"Included?\",Variables!$B$2:$BY$2,0))))","v":"N"},{"$f":"IF(G37=\"\",\"\",COUNTIF($G$4:G37,\"Y\"))","v":10},"",""]
[null,{"$f":"IF($I38=\"\",\"\",CONCATENATE(\"rename \",TRIM($I38),\" \",$J38,\"_\",Cover!$C$14,\", replace\"))","v":""},null,35,{"$f":"IF(Variables!E37=\"\",\"\",Variables!E37)","v":"unemp_inc3"},{"$f":"IFERROR(INDEX(Variables!$B:$BY,MATCH($E38,Variables!$E:$E,0),MATCH(Cover!$C$14,Variables!$B$2:$BY$2,0)),\"\")","v":"-"},{"$f":"IF(E38=\"\",\"\",IF(F38=\"-\",\"N\",INDEX(Variables!$B:$BY,MATCH(E38,Variables!$E:$E,0),MATCH(\"Included?\",Variables!$B$2:$BY$2,0))))","v":"N"},{"$f":"IF(G38=\"\",\"\",COUNTIF($G$4:G38,\"Y\"))","v":10},"",""]
[null,{"$f":"IF($I39=\"\",\"\",CONCATENATE(\"rename \",TRIM($I39),\" \",$J39,\"_\",Cover!$C$14,\", replace\"))","v":""},null,36,{"$f":"IF(Variables!E38=\"\",\"\",Variables!E38)","v":"unemp_inc4"},{"$f":"IFERROR(INDEX(Variables!$B:$BY,MATCH($E39,Variables!$E:$E,0),MATCH(Cover!$C$14,Variables!$B$2:$BY$2,0)),\"\")","v":"-"},{"$f":"IF(E39=\"\",\"\",IF(F39=\"-\",\"N\",INDEX(Variables!$B:$BY,MATCH(E39,Variables!$E:$E,0),MATCH(\"Included?\",Variables!$B$2:$BY$2,0))))","v":"N"},{"$f":"IF(G39=\"\",\"\",COUNTIF($G$4:G39,\"Y\"))","v":10},"",""]
[null,{"$f":"IF($I40=\"\",\"\",CONCATENATE(\"rename \",TRIM($I40),\" \",$J40,\"_\",Cover!$C$14,\", replace\"))","v":""},null,37,{"$f":"IF(Variables!E39=\"\",\"\",Variables!E39)","v":"unemp_inc4_TU"},{"$f":"IFERROR(INDEX(Variables!$B:$BY,MATCH($E40,Variables!$E:$E,0),MATCH(Cover!$C$14,Variables!$B$2:$BY$2,0)),\"\")","v":"-"},{"$f":"IF(E40=\"\",\"\",IF(F40=\"-\",\"N\",INDEX(Variables!$B:$BY,MATCH(E40,Variables!$E:$E,0),MATCH(\"Included?\",Variables!$B$2:$BY$2,0))))","v":"N"},{"$f":"IF(G40=\"\",\"\",COUNTIF($G$4:G40,\"Y\"))","v":10},"",""]
[null,{"$f":"IF($I41=\"\",\"\",CONCATENATE(\"rename \",TRIM($I41),\" \",$J41,\"_\",Cover!$C$14,\", replace\"))","v":""},null,38,{"$f":"IF(Variables!E40=\"\",\"\",Variables!E40)","v":"unemp_inc6"},{"$f":"IFERROR(INDEX(Variables!$B:$BY,MATCH($E41,Variables!$E:$E,0),MATCH(Cover!$C$14,Variables!$B$2:$BY$2,0)),\"\")","v":"-"},{"$f":"IF(E41=\"\",\"\",IF(F41=\"-\",\"N\",INDEX(Variables!$B:$BY,MATCH(E41,Variables!$E:$E,0),MATCH(\"Included?\",Variables!$B$2:$BY$2,0))))","v":"N"},{"$f":"IF(G41=\"\",\"\",COUNTIF($G$4:G41,\"Y\"))","v":10},"",""]
[null,{"$f":"IF($I42=\"\",\"\",CONCATENATE(\"rename \",TRIM($I42),\" \",$J42,\"_\",Cover!$C$14,\", replace\"))","v":""},null,39,{"$f":"IF(Variables!E41=\"\",\"\",Variables!E41)","v":"unemp_inc6_TU"},{"$f":"IFERROR(INDEX(Variables!$B:$BY,MATCH($E42,Variables!$E:$E,0),MATCH(Cover!$C$14,Variables!$B$2:$BY$2,0)),\"\")","v":"-"},{"$f":"IF(E42=\"\",\"\",IF(F42=\"-\",\"N\",INDEX(Variables!$B:$BY,MATCH(E42,Variables!$E:$E,0),MATCH(\"Included?\",Variables!$B$2:$BY$2,0))))","v":"N"},{"$f":"IF(G42=\"\",\"\",COUNTIF($G$4:G42,\"Y\"))","v":10},"",""]
[null,{"$f":"IF($I43=\"\",\"\",CONCATENATE(\"rename \",TRIM($I43),\" \",$J43,\"_\",Cover!$C$14,\", replace\"))","v":""},null,40,{"$f":"IF(Variables!E42=\"\",\"\",Variables!E42)","v":"wages1"},{"$f":"IFERROR(INDEX(Variables!$B:$BY,MATCH($E43,Variables!$E:$E,0),MATCH(Cover!$C$14,Variables!$B$2:$BY$2,0)),\"\")","v":"V74"},{"$f":"IF(E43=\"\",\"\",IF(F43=\"-\",\"N\",INDEX(Variables!$B:$BY,MATCH(E43,Variables!$E:$E,0),MATCH(\"Included?\",Variables!$B$2:$BY$2,0))))","v":"Y"},{"$f":"IF(G43=\"\",\"\",COUNTIF($G$4:G43,\"Y\"))","v":11},"",""]
[null,{"$f":"IF($I44=\"\",\"\",CONCATENATE(\"rename \",TRIM($I44),\" \",$J44,\"_\",Cover!$C$14,\", replace\"))","v":""},null,41,{"$f":"IF(Variables!E43=\"\",\"\",Variables!E43)","v":"wages2"},{"$f":"IFERROR(INDEX(Variables!$B:$BY,MATCH($E44,Variables!$E:$E,0),MATCH(Cover!$C$14,Variables!$B$2:$BY$2,0)),\"\")","v":"V75"},{"$f":"IF(E44=\"\",\"\",IF(F44=\"-\",\"N\",INDEX(Variables!$B:$BY,MATCH(E44,Variables!$E:$E,0),MATCH(\"Included?\",Variables!$B$2:$BY$2,0))))","v":"Y"},{"$f":"IF(G44=\"\",\"\",COUNTIF($G$4:G44,\"Y\"))","v":12},"",""]
[null,{"$f":"IF($I45=\"\",\"\",CONCATENATE(\"rename \",TRIM($I45),\" \",$J45,\"_\",Cover!$C$14,\", replace\"))","v":""},null,42,{"$f":"IF(Variables!E44=\"\",\"\",Variables!E44)","v":"wages3"},{"$f":"IFERROR(INDEX(Variables!$B:$BY,MATCH($E45,Variables!$E:$E,0),MATCH(Cover!$C$14,Variables!$B$2:$BY$2,0)),\"\")","v":"-"},{"$f":"IF(E45=\"\",\"\",IF(F45=\"-\",\"N\",INDEX(Variables!$B:$BY,MATCH(E45,Variables!$E:$E,0),MATCH(\"Included?\",Variables!$B$2:$BY$2,0))))","v":"N"},{"$f":"IF(G45=\"\",\"\",COUNTIF($G$4:G45,\"Y\"))","v":12},"",""]
[null,{"$f":"IF($I46=\"\",\"\",CONCATENATE(\"rename \",TRIM($I46),\" \",$J46,\"_\",Cover!$C$14,\", replace\"))","v":""},null,43,{"$f":"IF(Variables!E45=\"\",\"\",Variables!E45)","v":"wages4"},{"$f":"IFERROR(INDEX(Variables!$B:$BY,MATCH($E46,Variables!$E:$E,0),MATCH(Cover!$C$14,Variables!$B$2:$BY$2,0)),\"\")","v":"-"},{"$f":"IF(E46=\"\",\"\",IF(F46=\"-\",\"N\",INDEX(Variables!$B:$BY,MATCH(E46,Variables!$E:$E,0),MATCH(\"Included?\",Variables!$B$2:$BY$2,0))))","v":"N"},{"$f":"IF(G46=\"\",\"\",COUNTIF($G$4:G46,\"Y\"))","v":12},"",""]
[null,{"$f":"IF($I47=\"\",\"\",CONCATENATE(\"rename \",TRIM($I47),\" \",$J47,\"_\",Cover!$C$14,\", replace\"))","v":""},null,44,{"$f":"IF(Variables!E46=\"\",\"\",Variables!E46)","v":""},{"$f":"IFERROR(INDEX(Variables!$B:$BY,MATCH($E47,Variables!$E:$E,0),MATCH(Cover!$C$14,Variables!$B$2:$BY$2,0)),\"\")","v":""},{"$f":"IF(E47=\"\",\"\",IF(F47=\"-\",\"N\",INDEX(Variables!$B:$BY,MATCH(E47,Variables!$E:$E,0),MATCH(\"Included?\",Variables!$B$2:$BY$2,0))))","v":""},{"$f":"IF(G47=\"\",\"\",COUNTIF($G$4:G47,\"Y\"))","v":""},"",""]
[null,{"$f":"IF($I48=\"\",\"\",CONCATENATE(\"rename \",TRIM($I48),\" \",$J48,\"_\",Cover!$C$14,\", replace\"))","v":""},null,45,{"$f":"IF(Variables!E47=\"\",\"\",Variables!E47)","v":""},{"$f":"IFERROR(INDEX(Variables!$B:$BY,MATCH($E48,Variables!$E:$E,0),MATCH(Cover!$C$14,Variables!$B$2:$BY$2,0)),\"\")","v":""},{"$f":"IF(E48=\"\",\"\",IF(F48=\"-\",\"N\",INDEX(Variables!$B:$BY,MATCH(E48,Variables!$E:$E,0),MATCH(\"Included?\",Variables!$B$2:$BY$2,0))))","v":""},{"$f":"IF(G48=\"\",\"\",COUNTIF($G$4:G48,\"Y\"))","v":""},"",""]
[null,{"$f":"IF($I49=\"\",\"\",CONCATENATE(\"rename \",TRIM($I49),\" \",$J49,\"_\",Cover!$C$14,\", replace\"))","v":""},null,46,{"$f":"IF(Variables!E48=\"\",\"\",Variables!E48)","v":""},{"$f":"IFERROR(INDEX(Variables!$B:$BY,MATCH($E49,Variables!$E:$E,0),MATCH(Cover!$C$14,Variables!$B$2:$BY$2,0)),\"\")","v":""},{"$f":"IF(E49=\"\",\"\",IF(F49=\"-\",\"N\",INDEX(Variables!$B:$BY,MATCH(E49,Variables!$E:$E,0),MATCH(\"Included?\",Variables!$B$2:$BY$2,0))))","v":""},{"$f":"IF(G49=\"\",\"\",COUNTIF($G$4:G49,\"Y\"))","v":""},"",""]
[null,{"$f":"IF($I50=\"\",\"\",CONCATENATE(\"rename \",TRIM($I50),\" \",$J50,\"_\",Cover!$C$14,\", replace\"))","v":""},null,47,{"$f":"IF(Variables!E49=\"\",\"\",Variables!E49)","v":""},{"$f":"IFERROR(INDEX(Variables!$B:$BY,MATCH($E50,Variables!$E:$E,0),MATCH(Cover!$C$14,Variables!$B$2:$BY$2,0)),\"\")","v":""},{"$f":"IF(E50=\"\",\"\",IF(F50=\"-\",\"N\",INDEX(Variables!$B:$BY,MATCH(E50,Variables!$E:$E,0),MATCH(\"Included?\",Variables!$B$2:$BY$2,0))))","v":""},{"$f":"IF(G50=\"\",\"\",COUNTIF($G$4:G50,\"Y\"))","v":""},"",""]
[null,{"$f":"IF($I51=\"\",\"\",CONCATENATE(\"rename \",TRIM($I51),\" \",$J51,\"_\",Cover!$C$14,\", replace\"))","v":""},null,48,{"$f":"IF(Variables!E50=\"\",\"\",Variables!E50)","v":""},{"$f":"IFERROR(INDEX(Variables!$B:$BY,MATCH($E51,Variables!$E:$E,0),MATCH(Cover!$C$14,Variables!$B$2:$BY$2,0)),\"\")","v":""},{"$f":"IF(E51=\"\",\"\",IF(F51=\"-\",\"N\",INDEX(Variables!$B:$BY,MATCH(E51,Variables!$E:$E,0),MATCH(\"Included?\",Variables!$B$2:$BY$2,0))))","v":""},{"$f":"IF(G51=\"\",\"\",COUNTIF($G$4:G51,\"Y\"))","v":""},"",""]
[null,{"$f":"IF($I52=\"\",\"\",CONCATENATE(\"rename \",TRIM($I52),\" \",$J52,\"_\",Cover!$C$14,\", replace\"))","v":""},null,49,{"$f":"IF(Variables!E51=\"\",\"\",Variables!E51)","v":""},{"$f":"IFERROR(INDEX(Variables!$B:$BY,MATCH($E52,Variables!$E:$E,0),MATCH(Cover!$C$14,Variables!$B$2:$BY$2,0)),\"\")","v":""},{"$f":"IF(E52=\"\",\"\",IF(F52=\"-\",\"N\",INDEX(Variables!$B:$BY,MATCH(E52,Variables!$E:$E,0),MATCH(\"Included?\",Variables!$B$2:$BY$2,0))))","v":""},{"$f":"IF(G52=\"\",\"\",COUNTIF($G$4:G52,\"Y\"))","v":""},"",""]
[null,{"$f":"IF($I53=\"\",\"\",CONCATENATE(\"rename \",TRIM($I53),\" \",$J53,\"_\",Cover!$C$14,\", replace\"))","v":""},null,50,{"$f":"IF(Variables!E52=\"\",\"\",Variables!E52)","v":""},{"$f":"IFERROR(INDEX(Variables!$B:$BY,MATCH($E53,Variables!$E:$E,0),MATCH(Cover!$C$14,Variables!$B$2:$BY$2,0)),\"\")","v":""},{"$f":"IF(E53=\"\",\"\",IF(F53=\"-\",\"N\",INDEX(Variables!$B:$BY,MATCH(E53,Variables!$E:$E,0),MATCH(\"Included?\",Variables!$B$2:$BY$2,0))))","v":""},{"$f":"IF(G53=\"\",\"\",COUNTIF($G$4:G53,\"Y\"))","v":""},"",""]
[null,{"$f":"IF($I54=\"\",\"\",CONCATENATE(\"rename \",TRIM($I54),\" \",$J54,\"_\",Cover!$C$14,\", replace\"))","v":""},null,51,{"$f":"IF(Variables!E53=\"\",\"\",Variables!E53)","v":""},{"$f":"IFERROR(INDEX(Variables!$B:$BY,MATCH($E54,Variables!$E:$E,0),MATCH(Cover!$C$14,Variables!$B$2:$BY$2,0)),\"\")","v":""},{"$f":"IF(E54=\"\",\"\",IF(F54=\"-\",\"N\",INDEX(Variables!$B:$BY,MATCH(E54,Variables!$E:$E,0),MATCH(\"Included?\",Variables!$B$2:$BY$2,0))))","v":""},{"$f":"IF(G54=\"\",\"\",COUNTIF($G$4:G54,\"Y\"))","v":""},"",""]
[null,{"$f":"IF($I55=\"\",\"\",CONCATENATE(\"rename \",TRIM($I55),\" \",$J55,\"_\",Cover!$C$14,\", replace\"))","v":""},null,52,{"$f":"IF(Variables!E54=\"\",\"\",Variables!E54)","v":""},{"$f":"IFERROR(INDEX(Variables!$B:$BY,MATCH($E55,Variables!$E:$E,0),MATCH(Cover!$C$14,Variables!$B$2:$BY$2,0)),\"\")","v":""},{"$f":"IF(E55=\"\",\"\",IF(F55=\"-\",\"N\",INDEX(Variables!$B:$BY,MATCH(E55,Variables!$E:$E,0),MATCH(\"Included?\",Variables!$B$2:$BY$2,0))))","v":""},{"$f":"IF(G55=\"\",\"\",COUNTIF($G$4:G55,\"Y\"))","v":""},"",""]
[null,{"$f":"IF($I56=\"\",\"\",CONCATENATE(\"rename \",TRIM($I56),\" \",$J56,\"_\",Cover!$C$14,\", replace\"))","v":""},null,53,{"$f":"IF(Variables!E55=\"\",\"\",Variables!E55)","v":""},{"$f":"IFERROR(INDEX(Variables!$B:$BY,MATCH($E56,Variables!$E:$E,0),MATCH(Cover!$C$14,Variables!$B$2:$BY$2,0)),\"\")","v":""},{"$f":"IF(E56=\"\",\"\",IF(F56=\"-\",\"N\",INDEX(Variables!$B:$BY,MATCH(E56,Variables!$E:$E,0),MATCH(\"Included?\",Variables!$B$2:$BY$2,0))))","v":""},{"$f":"IF(G56=\"\",\"\",COUNTIF($G$4:G56,\"Y\"))","v":""},"",""]
[null,{"$f":"IF($I57=\"\",\"\",CONCATENATE(\"rename \",TRIM($I57),\" \",$J57,\"_\",Cover!$C$14,\", replace\"))","v":""},null,54,{"$f":"IF(Variables!E56=\"\",\"\",Variables!E56)","v":""},{"$f":"IFERROR(INDEX(Variables!$B:$BY,MATCH($E57,Variables!$E:$E,0),MATCH(Cover!$C$14,Variables!$B$2:$BY$2,0)),\"\")","v":""},{"$f":"IF(E57=\"\",\"\",IF(F57=\"-\",\"N\",INDEX(Variables!$B:$BY,MATCH(E57,Variables!$E:$E,0),MATCH(\"Included?\",Variables!$B$2:$BY$2,0))))","v":""},{"$f":"IF(G57=\"\",\"\",COUNTIF($G$4:G57,\"Y\"))","v":""},"",""]
[null,{"$f":"IF($I58=\"\",\"\",CONCATENATE(\"rename \",TRIM($I58),\" \",$J58,\"_\",Cover!$C$14,\", replace\"))","v":""},null,55,{"$f":"IF(Variables!E57=\"\",\"\",Variables!E57)","v":""},{"$f":"IFERROR(INDEX(Variables!$B:$BY,MATCH($E58,Variables!$E:$E,0),MATCH(Cover!$C$14,Variables!$B$2:$BY$2,0)),\"\")","v":""},{"$f":"IF(E58=\"\",\"\",IF(F58=\"-\",\"N\",INDEX(Variables!$B:$BY,MATCH(E58,Variables!$E:$E,0),MATCH(\"Included?\",Variables!$B$2:$BY$2,0))))","v":""},{"$f":"IF(G58=\"\",\"\",COUNTIF($G$4:G58,\"Y\"))","v":""},"",""]
[null,{"$f":"IF($I59=\"\",\"\",CONCATENATE(\"rename \",TRIM($I59),\" \",$J59,\"_\",Cover!$C$14,\", replace\"))","v":""},null,56,{"$f":"IF(Variables!E58=\"\",\"\",Variables!E58)","v":""},{"$f":"IFERROR(INDEX(Variables!$B:$BY,MATCH($E59,Variables!$E:$E,0),MATCH(Cover!$C$14,Variables!$B$2:$BY$2,0)),\"\")","v":""},{"$f":"IF(E59=\"\",\"\",IF(F59=\"-\",\"N\",INDEX(Variables!$B:$BY,MATCH(E59,Variables!$E:$E,0),MATCH(\"Included?\",Variables!$B$2:$BY$2,0))))","v":""},{"$f":"IF(G59=\"\",\"\",COUNTIF($G$4:G59,\"Y\"))","v":""},"",""]
[null,{"$f":"IF($I60=\"\",\"\",CONCATENATE(\"rename \",TRIM($I60),\" \",$J60,\"_\",Cover!$C$14,\", replace\"))","v":""},null,57,{"$f":"IF(Variables!E59=\"\",\"\",Variables!E59)","v":""},{"$f":"IFERROR(INDEX(Variables!$B:$BY,MATCH($E60,Variables!$E:$E,0),MATCH(Cover!$C$14,Variables!$B$2:$BY$2,0)),\"\")","v":""},{"$f":"IF(E60=\"\",\"\",IF(F60=\"-\",\"N\",INDEX(Variables!$B:$BY,MATCH(E60,Variables!$E:$E,0),MATCH(\"Included?\",Variables!$B$2:$BY$2,0))))","v":""},{"$f":"IF(G60=\"\",\"\",COUNTIF($G$4:G60,\"Y\"))","v":""},"",""]
[null,{"$f":"IF($I61=\"\",\"\",CONCATENATE(\"rename \",TRIM($I61),\" \",$J61,\"_\",Cover!$C$14,\", replace\"))","v":""},null,58,{"$f":"IF(Variables!E60=\"\",\"\",Variables!E60)","v":""},{"$f":"IFERROR(INDEX(Variables!$B:$BY,MATCH($E61,Variables!$E:$E,0),MATCH(Cover!$C$14,Variables!$B$2:$BY$2,0)),\"\")","v":""},{"$f":"IF(E61=\"\",\"\",IF(F61=\"-\",\"N\",INDEX(Variables!$B:$BY,MATCH(E61,Variables!$E:$E,0),MATCH(\"Included?\",Variables!$B$2:$BY$2,0))))","v":""},{"$f":"IF(G61=\"\",\"\",COUNTIF($G$4:G61,\"Y\"))","v":""},"",""]
[null,{"$f":"IF($I62=\"\",\"\",CONCATENATE(\"rename \",TRIM($I62),\" \",$J62,\"_\",Cover!$C$14,\", replace\"))","v":""},null,59,{"$f":"IF(Variables!E61=\"\",\"\",Variables!E61)","v":""},{"$f":"IFERROR(INDEX(Variables!$B:$BY,MATCH($E62,Variables!$E:$E,0),MATCH(Cover!$C$14,Variables!$B$2:$BY$2,0)),\"\")","v":""},{"$f":"IF(E62=\"\",\"\",IF(F62=\"-\",\"N\",INDEX(Variables!$B:$BY,MATCH(E62,Variables!$E:$E,0),MATCH(\"Included?\",Variables!$B$2:$BY$2,0))))","v":""},{"$f":"IF(G62=\"\",\"\",COUNTIF($G$4:G62,\"Y\"))","v":""},"",""]
[null,{"$f":"IF($I63=\"\",\"\",CONCATENATE(\"rename \",TRIM($I63),\" \",$J63,\"_\",Cover!$C$14,\", replace\"))","v":""},null,60,{"$f":"IF(Variables!E62=\"\",\"\",Variables!E62)","v":""},{"$f":"IFERROR(INDEX(Variables!$B:$BY,MATCH($E63,Variables!$E:$E,0),MATCH(Cover!$C$14,Variables!$B$2:$BY$2,0)),\"\")","v":""},{"$f":"IF(E63=\"\",\"\",IF(F63=\"-\",\"N\",INDEX(Variables!$B:$BY,MATCH(E63,Variables!$E:$E,0),MATCH(\"Included?\",Variables!$B$2:$BY$2,0))))","v":""},{"$f":"IF(G63=\"\",\"\",COUNTIF($G$4:G63,\"Y\"))","v":""},"",""]
[null,{"$f":"IF($I64=\"\",\"\",CONCATENATE(\"rename \",TRIM($I64),\" \",$J64,\"_\",Cover!$C$14,\", replace\"))","v":""},null,61,{"$f":"IF(Variables!E63=\"\",\"\",Variables!E63)","v":""},{"$f":"IFERROR(INDEX(Variables!$B:$BY,MATCH($E64,Variables!$E:$E,0),MATCH(Cover!$C$14,Variables!$B$2:$BY$2,0)),\"\")","v":""},{"$f":"IF(E64=\"\",\"\",IF(F64=\"-\",\"N\",INDEX(Variables!$B:$BY,MATCH(E64,Variables!$E:$E,0),MATCH(\"Included?\",Variables!$B$2:$BY$2,0))))","v":""},{"$f":"IF(G64=\"\",\"\",COUNTIF($G$4:G64,\"Y\"))","v":""},"",""]
[null,{"$f":"IF($I65=\"\",\"\",CONCATENATE(\"rename \",TRIM($I65),\" \",$J65,\"_\",Cover!$C$14,\", replace\"))","v":""},null,62,{"$f":"IF(Variables!E64=\"\",\"\",Variables!E64)","v":""},{"$f":"IFERROR(INDEX(Variables!$B:$BY,MATCH($E65,Variables!$E:$E,0),MATCH(Cover!$C$14,Variables!$B$2:$BY$2,0)),\"\")","v":""},{"$f":"IF(E65=\"\",\"\",IF(F65=\"-\",\"N\",INDEX(Variables!$B:$BY,MATCH(E65,Variables!$E:$E,0),MATCH(\"Included?\",Variables!$B$2:$BY$2,0))))","v":""},{"$f":"IF(G65=\"\",\"\",COUNTIF($G$4:G65,\"Y\"))","v":""},"",""]
[null,{"$f":"IF($I66=\"\",\"\",CONCATENATE(\"rename \",TRIM($I66),\" \",$J66,\"_\",Cover!$C$14,\", replace\"))","v":""},null,63,{"$f":"IF(Variables!E65=\"\",\"\",Variables!E65)","v":""},{"$f":"IFERROR(INDEX(Variables!$B:$BY,MATCH($E66,Variables!$E:$E,0),MATCH(Cover!$C$14,Variables!$B$2:$BY$2,0)),\"\")","v":""},{"$f":"IF(E66=\"\",\"\",IF(F66=\"-\",\"N\",INDEX(Variables!$B:$BY,MATCH(E66,Variables!$E:$E,0),MATCH(\"Included?\",Variables!$B$2:$BY$2,0))))","v":""},{"$f":"IF(G66=\"\",\"\",COUNTIF($G$4:G66,\"Y\"))","v":""},"",""]
[null,{"$f":"IF($I67=\"\",\"\",CONCATENATE(\"rename \",TRIM($I67),\" \",$J67,\"_\",Cover!$C$14,\", replace\"))","v":""},null,64,{"$f":"IF(Variables!E66=\"\",\"\",Variables!E66)","v":""},{"$f":"IFERROR(INDEX(Variables!$B:$BY,MATCH($E67,Variables!$E:$E,0),MATCH(Cover!$C$14,Variables!$B$2:$BY$2,0)),\"\")","v":""},{"$f":"IF(E67=\"\",\"\",IF(F67=\"-\",\"N\",INDEX(Variables!$B:$BY,MATCH(E67,Variables!$E:$E,0),MATCH(\"Included?\",Variables!$B$2:$BY$2,0))))","v":""},{"$f":"IF(G67=\"\",\"\",COUNTIF($G$4:G67,\"Y\"))","v":""},"",""]
[null,{"$f":"IF($I68=\"\",\"\",CONCATENATE(\"rename \",TRIM($I68),\" \",$J68,\"_\",Cover!$C$14,\", replace\"))","v":""},null,65,{"$f":"IF(Variables!E67=\"\",\"\",Variables!E67)","v":""},{"$f":"IFERROR(INDEX(Variables!$B:$BY,MATCH($E68,Variables!$E:$E,0),MATCH(Cover!$C$14,Variables!$B$2:$BY$2,0)),\"\")","v":""},{"$f":"IF(E68=\"\",\"\",IF(F68=\"-\",\"N\",INDEX(Variables!$B:$BY,MATCH(E68,Variables!$E:$E,0),MATCH(\"Included?\",Variables!$B$2:$BY$2,0))))","v":""},{"$f":"IF(G68=\"\",\"\",COUNTIF($G$4:G68,\"Y\"))","v":""},"",""]
[null,{"$f":"IF($I69=\"\",\"\",CONCATENATE(\"rename \",TRIM($I69),\" \",$J69,\"_\",Cover!$C$14,\", replace\"))","v":""},null,66,{"$f":"IF(Variables!E68=\"\",\"\",Variables!E68)","v":""},{"$f":"IFERROR(INDEX(Variables!$B:$BY,MATCH($E69,Variables!$E:$E,0),MATCH(Cover!$C$14,Variables!$B$2:$BY$2,0)),\"\")","v":""},{"$f":"IF(E69=\"\",\"\",IF(F69=\"-\",\"N\",INDEX(Variables!$B:$BY,MATCH(E69,Variables!$E:$E,0),MATCH(\"Included?\",Variables!$B$2:$BY$2,0))))","v":""},{"$f":"IF(G69=\"\",\"\",COUNTIF($G$4:G69,\"Y\"))","v":""},{"$f":"IFERROR(TRIM(INDEX($F:$F,MATCH($D69,$H:$H,0),1)),\"\")","v":""},{"$f":"IFERROR(TRIM(INDEX($E:$E,MATCH($I69,$F:$F,0),1)),\"\")","v":""}]
[null,{"$f":"IF($I70=\"\",\"\",CONCATENATE(\"rename \",TRIM($I70),\" \",$J70,\"_\",Cover!$C$14,\", replace\"))","v":""},null,67,{"$f":"IF(Variables!E69=\"\",\"\",Variables!E69)","v":""},{"$f":"IFERROR(INDEX(Variables!$B:$BY,MATCH($E70,Variables!$E:$E,0),MATCH(Cover!$C$14,Variables!$B$2:$BY$2,0)),\"\")","v":""},{"$f":"IF(E70=\"\",\"\",IF(F70=\"-\",\"N\",INDEX(Variables!$B:$BY,MATCH(E70,Variables!$E:$E,0),MATCH(\"Included?\",Variables!$B$2:$BY$2,0))))","v":""},{"$f":"IF(G70=\"\",\"\",COUNTIF($G$4:G70,\"Y\"))","v":""},"",""]
[null,{"$f":"IF($I71=\"\",\"\",CONCATENATE(\"rename \",TRIM($I71),\" \",$J71,\"_\",Cover!$C$14,\", replace\"))","v":""},null,68,{"$f":"IF(Variables!E70=\"\",\"\",Variables!E70)","v":""},{"$f":"IFERROR(INDEX(Variables!$B:$BY,MATCH($E71,Variables!$E:$E,0),MATCH(Cover!$C$14,Variables!$B$2:$BY$2,0)),\"\")","v":""},{"$f":"IF(E71=\"\",\"\",IF(F71=\"-\",\"N\",INDEX(Variables!$B:$BY,MATCH(E71,Variables!$E:$E,0),MATCH(\"Included?\",Variables!$B$2:$BY$2,0))))","v":""},{"$f":"IF(G71=\"\",\"\",COUNTIF($G$4:G71,\"Y\"))","v":""},"",""]
[null,{"$f":"IF($I72=\"\",\"\",CONCATENATE(\"rename \",TRIM($I72),\" \",$J72,\"_\",Cover!$C$14,\", replace\"))","v":""},null,69,{"$f":"IF(Variables!E71=\"\",\"\",Variables!E71)","v":""},{"$f":"IFERROR(INDEX(Variables!$B:$BY,MATCH($E72,Variables!$E:$E,0),MATCH(Cover!$C$14,Variables!$B$2:$BY$2,0)),\"\")","v":""},{"$f":"IF(E72=\"\",\"\",IF(F72=\"-\",\"N\",INDEX(Variables!$B:$BY,MATCH(E72,Variables!$E:$E,0),MATCH(\"Included?\",Variables!$B$2:$BY$2,0))))","v":""},{"$f":"IF(G72=\"\",\"\",COUNTIF($G$4:G72,\"Y\"))","v":""},"",""]
[null,{"$f":"IF($I73=\"\",\"\",CONCATENATE(\"rename \",TRIM($I73),\" \",$J73,\"_\",Cover!$C$14,\", replace\"))","v":""},null,70,{"$f":"IF(Variables!E72=\"\",\"\",Variables!E72)","v":""},{"$f":"IFERROR(INDEX(Variables!$B:$BY,MATCH($E73,Variables!$E:$E,0),MATCH(Cover!$C$14,Variables!$B$2:$BY$2,0)),\"\")","v":""},{"$f":"IF(E73=\"\",\"\",IF(F73=\"-\",\"N\",INDEX(Variables!$B:$BY,MATCH(E73,Variables!$E:$E,0),MATCH(\"Included?\",Variables!$B$2:$BY$2,0))))","v":""},{"$f":"IF(G73=\"\",\"\",COUNTIF($G$4:G73,\"Y\"))","v":""},"",""]
[null,{"$f":"IF($I74=\"\",\"\",CONCATENATE(\"rename \",TRIM($I74),\" \",$J74,\"_\",Cover!$C$14,\", replace\"))","v":""},null,71,{"$f":"IF(Variables!E73=\"\",\"\",Variables!E73)","v":""},{"$f":"IFERROR(INDEX(Variables!$B:$BY,MATCH($E74,Variables!$E:$E,0),MATCH(Cover!$C$14,Variables!$B$2:$BY$2,0)),\"\")","v":""},{"$f":"IF(E74=\"\",\"\",IF(F74=\"-\",\"N\",INDEX(Variables!$B:$BY,MATCH(E74,Variables!$E:$E,0),MATCH(\"Included?\",Variables!$B$2:$BY$2,0))))","v":""},{"$f":"IF(G74=\"\",\"\",COUNTIF($G$4:G74,\"Y\"))","v":""},"",""]
[null,{"$f":"IF($I75=\"\",\"\",CONCATENATE(\"rename \",TRIM($I75),\" \",$J75,\"_\",Cover!$C$14,\", replace\"))","v":""},null,72,{"$f":"IF(Variables!E74=\"\",\"\",Variables!E74)","v":""},{"$f":"IFERROR(INDEX(Variables!$B:$BY,MATCH($E75,Variables!$E:$E,0),MATCH(Cover!$C$14,Variables!$B$2:$BY$2,0)),\"\")","v":""},{"$f":"IF(E75=\"\",\"\",IF(F75=\"-\",\"N\",INDEX(Variables!$B:$BY,MATCH(E75,Variables!$E:$E,0),MATCH(\"Included?\",Variables!$B$2:$BY$2,0))))","v":""},{"$f":"IF(G75=\"\",\"\",COUNTIF($G$4:G75,\"Y\"))","v":""},"",""]
[null,{"$f":"IF($I76=\"\",\"\",CONCATENATE(\"rename \",TRIM($I76),\" \",$J76,\"_\",Cover!$C$14,\", replace\"))","v":""},null,73,{"$f":"IF(Variables!E75=\"\",\"\",Variables!E75)","v":""},{"$f":"IFERROR(INDEX(Variables!$B:$BY,MATCH($E76,Variables!$E:$E,0),MATCH(Cover!$C$14,Variables!$B$2:$BY$2,0)),\"\")","v":""},{"$f":"IF(E76=\"\",\"\",IF(F76=\"-\",\"N\",INDEX(Variables!$B:$BY,MATCH(E76,Variables!$E:$E,0),MATCH(\"Included?\",Variables!$B$2:$BY$2,0))))","v":""},{"$f":"IF(G76=\"\",\"\",COUNTIF($G$4:G76,\"Y\"))","v":""},"",""]
[null,{"$f":"IF($I77=\"\",\"\",CONCATENATE(\"rename \",TRIM($I77),\" \",$J77,\"_\",Cover!$C$14,\", replace\"))","v":""},null,74,{"$f":"IF(Variables!E76=\"\",\"\",Variables!E76)","v":""},{"$f":"IFERROR(INDEX(Variables!$B:$BY,MATCH($E77,Variables!$E:$E,0),MATCH(Cover!$C$14,Variables!$B$2:$BY$2,0)),\"\")","v":""},{"$f":"IF(E77=\"\",\"\",IF(F77=\"-\",\"N\",INDEX(Variables!$B:$BY,MATCH(E77,Variables!$E:$E,0),MATCH(\"Included?\",Variables!$B$2:$BY$2,0))))","v":""},{"$f":"IF(G77=\"\",\"\",COUNTIF($G$4:G77,\"Y\"))","v":""},"",""]
[null,{"$f":"IF($I78=\"\",\"\",CONCATENATE(\"rename \",TRIM($I78),\" \",$J78,\"_\",Cover!$C$14,\", replace\"))","v":""},null,75,{"$f":"IF(Variables!E77=\"\",\"\",Variables!E77)","v":""},{"$f":"IFERROR(INDEX(Variables!$B:$BY,MATCH($E78,Variables!$E:$E,0),MATCH(Cover!$C$14,Variables!$B$2:$BY$2,0)),\"\")","v":""},{"$f":"IF(E78=\"\",\"\",IF(F78=\"-\",\"N\",INDEX(Variables!$B:$BY,MATCH(E78,Variables!$E:$E,0),MATCH(\"Included?\",Variables!$B$2:$BY$2,0))))","v":""},{"$f":"IF(G78=\"\",\"\",COUNTIF($G$4:G78,\"Y\"))","v":""},"",""]
[null,{"$f":"IF($I79=\"\",\"\",CONCATENATE(\"rename \",TRIM($I79),\" \",$J79,\"_\",Cover!$C$14,\", replace\"))","v":""},null,76,{"$f":"IF(Variables!E78=\"\",\"\",Variables!E78)","v":""},{"$f":"IFERROR(INDEX(Variables!$B:$BY,MATCH($E79,Variables!$E:$E,0),MATCH(Cover!$C$14,Variables!$B$2:$BY$2,0)),\"\")","v":""},{"$f":"IF(E79=\"\",\"\",IF(F79=\"-\",\"N\",INDEX(Variables!$B:$BY,MATCH(E79,Variables!$E:$E,0),MATCH(\"Included?\",Variables!$B$2:$BY$2,0))))","v":""},{"$f":"IF(G79=\"\",\"\",COUNTIF($G$4:G79,\"Y\"))","v":""},"",""]
[null,{"$f":"IF($I80=\"\",\"\",CONCATENATE(\"rename \",TRIM($I80),\" \",$J80,\"_\",Cover!$C$14,\", replace\"))","v":""},null,77,{"$f":"IF(Variables!E79=\"\",\"\",Variables!E79)","v":""},{"$f":"IFERROR(INDEX(Variables!$B:$BY,MATCH($E80,Variables!$E:$E,0),MATCH(Cover!$C$14,Variables!$B$2:$BY$2,0)),\"\")","v":""},{"$f":"IF(E80=\"\",\"\",IF(F80=\"-\",\"N\",INDEX(Variables!$B:$BY,MATCH(E80,Variables!$E:$E,0),MATCH(\"Included?\",Variables!$B$2:$BY$2,0))))","v":""},{"$f":"IF(G80=\"\",\"\",COUNTIF($G$4:G80,\"Y\"))","v":""},"",""]
[null,{"$f":"IF($I81=\"\",\"\",CONCATENATE(\"rename \",TRIM($I81),\" \",$J81,\"_\",Cover!$C$14,\", replace\"))","v":""},null,78,{"$f":"IF(Variables!E80=\"\",\"\",Variables!E80)","v":""},{"$f":"IFERROR(INDEX(Variables!$B:$BY,MATCH($E81,Variables!$E:$E,0),MATCH(Cover!$C$14,Variables!$B$2:$BY$2,0)),\"\")","v":""},{"$f":"IF(E81=\"\",\"\",IF(F81=\"-\",\"N\",INDEX(Variables!$B:$BY,MATCH(E81,Variables!$E:$E,0),MATCH(\"Included?\",Variables!$B$2:$BY$2,0))))","v":""},{"$f":"IF(G81=\"\",\"\",COUNTIF($G$4:G81,\"Y\"))","v":""},"",""]
[null,{"$f":"IF($I82=\"\",\"\",CONCATENATE(\"rename \",TRIM($I82),\" \",$J82,\"_\",Cover!$C$14,\", replace\"))","v":""},null,79,{"$f":"IF(Variables!E81=\"\",\"\",Variables!E81)","v":""},{"$f":"IFERROR(INDEX(Variables!$B:$BY,MATCH($E82,Variables!$E:$E,0),MATCH(Cover!$C$14,Variables!$B$2:$BY$2,0)),\"\")","v":""},{"$f":"IF(E82=\"\",\"\",IF(F82=\"-\",\"N\",INDEX(Variables!$B:$BY,MATCH(E82,Variables!$E:$E,0),MATCH(\"Included?\",Variables!$B$2:$BY$2,0))))","v":""},{"$f":"IF(G82=\"\",\"\",COUNTIF($G$4:G82,\"Y\"))","v":""},"",""]
[null,{"$f":"IF($I83=\"\",\"\",CONCATENATE(\"rename \",TRIM($I83),\" \",$J83,\"_\",Cover!$C$14,\", replace\"))","v":""},null,80,{"$f":"IF(Variables!E82=\"\",\"\",Variables!E82)","v":""},{"$f":"IFERROR(INDEX(Variables!$B:$BY,MATCH($E83,Variables!$E:$E,0),MATCH(Cover!$C$14,Variables!$B$2:$BY$2,0)),\"\")","v":""},{"$f":"IF(E83=\"\",\"\",IF(F83=\"-\",\"N\",INDEX(Variables!$B:$BY,MATCH(E83,Variables!$E:$E,0),MATCH(\"Included?\",Variables!$B$2:$BY$2,0))))","v":""},{"$f":"IF(G83=\"\",\"\",COUNTIF($G$4:G83,\"Y\"))","v":""},"",""]
[null,{"$f":"IF($I84=\"\",\"\",CONCATENATE(\"rename \",TRIM($I84),\" \",$J84,\"_\",Cover!$C$14,\", replace\"))","v":""},null,81,{"$f":"IF(Variables!E83=\"\",\"\",Variables!E83)","v":""},{"$f":"IFERROR(INDEX(Variables!$B:$BY,MATCH($E84,Variables!$E:$E,0),MATCH(Cover!$C$14,Variables!$B$2:$BY$2,0)),\"\")","v":""},{"$f":"IF(E84=\"\",\"\",IF(F84=\"-\",\"N\",INDEX(Variables!$B:$BY,MATCH(E84,Variables!$E:$E,0),MATCH(\"Included?\",Variables!$B$2:$BY$2,0))))","v":""},{"$f":"IF(G84=\"\",\"\",COUNTIF($G$4:G84,\"Y\"))","v":""},"",""]
[null,{"$f":"IF($I85=\"\",\"\",CONCATENATE(\"rename \",TRIM($I85),\" \",$J85,\"_\",Cover!$C$14,\", replace\"))","v":""},null,82,{"$f":"IF(Variables!E84=\"\",\"\",Variables!E84)","v":""},{"$f":"IFERROR(INDEX(Variables!$B:$BY,MATCH($E85,Variables!$E:$E,0),MATCH(Cover!$C$14,Variables!$B$2:$BY$2,0)),\"\")","v":""},{"$f":"IF(E85=\"\",\"\",IF(F85=\"-\",\"N\",INDEX(Variables!$B:$BY,MATCH(E85,Variables!$E:$E,0),MATCH(\"Included?\",Variables!$B$2:$BY$2,0))))","v":""},{"$f":"IF(G85=\"\",\"\",COUNTIF($G$4:G85,\"Y\"))","v":""},"",""]
[null,{"$f":"IF($I86=\"\",\"\",CONCATENATE(\"rename \",TRIM($I86),\" \",$J86,\"_\",Cover!$C$14,\", replace\"))","v":""},null,83,{"$f":"IF(Variables!E85=\"\",\"\",Variables!E85)","v":""},{"$f":"IFERROR(INDEX(Variables!$B:$BY,MATCH($E86,Variables!$E:$E,0),MATCH(Cover!$C$14,Variables!$B$2:$BY$2,0)),\"\")","v":""},{"$f":"IF(E86=\"\",\"\",IF(F86=\"-\",\"N\",INDEX(Variables!$B:$BY,MATCH(E86,Variables!$E:$E,0),MATCH(\"Included?\",Variables!$B$2:$BY$2,0))))","v":""},{"$f":"IF(G86=\"\",\"\",COUNTIF($G$4:G86,\"Y\"))","v":""},"",""]
[null,{"$f":"IF($I87=\"\",\"\",CONCATENATE(\"rename \",TRIM($I87),\" \",$J87,\"_\",Cover!$C$14,\", replace\"))","v":""},null,84,{"$f":"IF(Variables!E86=\"\",\"\",Variables!E86)","v":""},{"$f":"IFERROR(INDEX(Variables!$B:$BY,MATCH($E87,Variables!$E:$E,0),MATCH(Cover!$C$14,Variables!$B$2:$BY$2,0)),\"\")","v":""},{"$f":"IF(E87=\"\",\"\",IF(F87=\"-\",\"N\",INDEX(Variables!$B:$BY,MATCH(E87,Variables!$E:$E,0),MATCH(\"Included?\",Variables!$B$2:$BY$2,0))))","v":""},{"$f":"IF(G87=\"\",\"\",COUNTIF($G$4:G87,\"Y\"))","v":""},"",""]
[null,{"$f":"IF($I88=\"\",\"\",CONCATENATE(\"rename \",TRIM($I88),\" \",$J88,\"_\",Cover!$C$14,\", replace\"))","v":""},null,85,{"$f":"IF(Variables!E87=\"\",\"\",Variables!E87)","v":""},{"$f":"IFERROR(INDEX(Variables!$B:$BY,MATCH($E88,Variables!$E:$E,0),MATCH(Cover!$C$14,Variables!$B$2:$BY$2,0)),\"\")","v":""},{"$f":"IF(E88=\"\",\"\",IF(F88=\"-\",\"N\",INDEX(Variables!$B:$BY,MATCH(E88,Variables!$E:$E,0),MATCH(\"Included?\",Variables!$B$2:$BY$2,0))))","v":""},{"$f":"IF(G88=\"\",\"\",COUNTIF($G$4:G88,\"Y\"))","v":""},"",""]
[null,{"$f":"IF($I89=\"\",\"\",CONCATENATE(\"rename \",TRIM($I89),\" \",$J89,\"_\",Cover!$C$14,\", replace\"))","v":""},null,86,{"$f":"IF(Variables!E88=\"\",\"\",Variables!E88)","v":""},{"$f":"IFERROR(INDEX(Variables!$B:$BY,MATCH($E89,Variables!$E:$E,0),MATCH(Cover!$C$14,Variables!$B$2:$BY$2,0)),\"\")","v":""},{"$f":"IF(E89=\"\",\"\",IF(F89=\"-\",\"N\",INDEX(Variables!$B:$BY,MATCH(E89,Variables!$E:$E,0),MATCH(\"Included?\",Variables!$B$2:$BY$2,0))))","v":""},{"$f":"IF(G89=\"\",\"\",COUNTIF($G$4:G89,\"Y\"))","v":""},"",""]
[null,{"$f":"IF($I90=\"\",\"\",CONCATENATE(\"rename \",TRIM($I90),\" \",$J90,\"_\",Cover!$C$14,\", replace\"))","v":""},null,87,{"$f":"IF(Variables!E89=\"\",\"\",Variables!E89)","v":""},{"$f":"IFERROR(INDEX(Variables!$B:$BY,MATCH($E90,Variables!$E:$E,0),MATCH(Cover!$C$14,Variables!$B$2:$BY$2,0)),\"\")","v":""},{"$f":"IF(E90=\"\",\"\",IF(F90=\"-\",\"N\",INDEX(Variables!$B:$BY,MATCH(E90,Variables!$E:$E,0),MATCH(\"Included?\",Variables!$B$2:$BY$2,0))))","v":""},{"$f":"IF(G90=\"\",\"\",COUNTIF($G$4:G90,\"Y\"))","v":""},"",""]
[null,{"$f":"IF($I91=\"\",\"\",CONCATENATE(\"rename \",TRIM($I91),\" \",$J91,\"_\",Cover!$C$14,\", replace\"))","v":""},null,88,{"$f":"IF(Variables!E90=\"\",\"\",Variables!E90)","v":""},{"$f":"IFERROR(INDEX(Variables!$B:$BY,MATCH($E91,Variables!$E:$E,0),MATCH(Cover!$C$14,Variables!$B$2:$BY$2,0)),\"\")","v":""},{"$f":"IF(E91=\"\",\"\",IF(F91=\"-\",\"N\",INDEX(Variables!$B:$BY,MATCH(E91,Variables!$E:$E,0),MATCH(\"Included?\",Variables!$B$2:$BY$2,0))))","v":""},{"$f":"IF(G91=\"\",\"\",COUNTIF($G$4:G91,\"Y\"))","v":""},"",""]
[null,{"$f":"IF($I92=\"\",\"\",CONCATENATE(\"rename \",TRIM($I92),\" \",$J92,\"_\",Cover!$C$14,\", replace\"))","v":""},null,89,{"$f":"IF(Variables!E91=\"\",\"\",Variables!E91)","v":""},{"$f":"IFERROR(INDEX(Variables!$B:$BY,MATCH($E92,Variables!$E:$E,0),MATCH(Cover!$C$14,Variables!$B$2:$BY$2,0)),\"\")","v":""},{"$f":"IF(E92=\"\",\"\",IF(F92=\"-\",\"N\",INDEX(Variables!$B:$BY,MATCH(E92,Variables!$E:$E,0),MATCH(\"Included?\",Variables!$B$2:$BY$2,0))))","v":""},{"$f":"IF(G92=\"\",\"\",COUNTIF($G$4:G92,\"Y\"))","v":""},"",""]
[null,{"$f":"IF($I93=\"\",\"\",CONCATENATE(\"rename \",TRIM($I93),\" \",$J93,\"_\",Cover!$C$14,\", replace\"))","v":""},null,90,{"$f":"IF(Variables!E92=\"\",\"\",Variables!E92)","v":""},{"$f":"IFERROR(INDEX(Variables!$B:$BY,MATCH($E93,Variables!$E:$E,0),MATCH(Cover!$C$14,Variables!$B$2:$BY$2,0)),\"\")","v":""},{"$f":"IF(E93=\"\",\"\",IF(F93=\"-\",\"N\",INDEX(Variables!$B:$BY,MATCH(E93,Variables!$E:$E,0),MATCH(\"Included?\",Variables!$B$2:$BY$2,0))))","v":""},{"$f":"IF(G93=\"\",\"\",COUNTIF($G$4:G93,\"Y\"))","v":""},"",""]
[null,{"$f":"IF($I94=\"\",\"\",CONCATENATE(\"rename \",TRIM($I94),\" \",$J94,\"_\",Cover!$C$14,\", replace\"))","v":""},null,91,{"$f":"IF(Variables!E93=\"\",\"\",Variables!E93)","v":""},{"$f":"IFERROR(INDEX(Variables!$B:$BY,MATCH($E94,Variables!$E:$E,0),MATCH(Cover!$C$14,Variables!$B$2:$BY$2,0)),\"\")","v":""},{"$f":"IF(E94=\"\",\"\",IF(F94=\"-\",\"N\",INDEX(Variables!$B:$BY,MATCH(E94,Variables!$E:$E,0),MATCH(\"Included?\",Variables!$B$2:$BY$2,0))))","v":""},{"$f":"IF(G94=\"\",\"\",COUNTIF($G$4:G94,\"Y\"))","v":""},"",""]
[null,{"$f":"IF($I95=\"\",\"\",CONCATENATE(\"rename \",TRIM($I95),\" \",$J95,\"_\",Cover!$C$14,\", replace\"))","v":""},null,92,{"$f":"IF(Variables!E94=\"\",\"\",Variables!E94)","v":""},{"$f":"IFERROR(INDEX(Variables!$B:$BY,MATCH($E95,Variables!$E:$E,0),MATCH(Cover!$C$14,Variables!$B$2:$BY$2,0)),\"\")","v":""},{"$f":"IF(E95=\"\",\"\",IF(F95=\"-\",\"N\",INDEX(Variables!$B:$BY,MATCH(E95,Variables!$E:$E,0),MATCH(\"Included?\",Variables!$B$2:$BY$2,0))))","v":""},{"$f":"IF(G95=\"\",\"\",COUNTIF($G$4:G95,\"Y\"))","v":""},"",""]
[null,{"$f":"IF($I96=\"\",\"\",CONCATENATE(\"rename \",TRIM($I96),\" \",$J96,\"_\",Cover!$C$14,\", replace\"))","v":""},null,93,{"$f":"IF(Variables!E95=\"\",\"\",Variables!E95)","v":""},{"$f":"IFERROR(INDEX(Variables!$B:$BY,MATCH($E96,Variables!$E:$E,0),MATCH(Cover!$C$14,Variables!$B$2:$BY$2,0)),\"\")","v":""},{"$f":"IF(E96=\"\",\"\",IF(F96=\"-\",\"N\",INDEX(Variables!$B:$BY,MATCH(E96,Variables!$E:$E,0),MATCH(\"Included?\",Variables!$B$2:$BY$2,0))))","v":""},{"$f":"IF(G96=\"\",\"\",COUNTIF($G$4:G96,\"Y\"))","v":""},"",""]
[null,{"$f":"IF($I97=\"\",\"\",CONCATENATE(\"rename \",TRIM($I97),\" \",$J97,\"_\",Cover!$C$14,\", replace\"))","v":""},null,94,{"$f":"IF(Variables!E96=\"\",\"\",Variables!E96)","v":""},{"$f":"IFERROR(INDEX(Variables!$B:$BY,MATCH($E97,Variables!$E:$E,0),MATCH(Cover!$C$14,Variables!$B$2:$BY$2,0)),\"\")","v":""},{"$f":"IF(E97=\"\",\"\",IF(F97=\"-\",\"N\",INDEX(Variables!$B:$BY,MATCH(E97,Variables!$E:$E,0),MATCH(\"Included?\",Variables!$B$2:$BY$2,0))))","v":""},{"$f":"IF(G97=\"\",\"\",COUNTIF($G$4:G97,\"Y\"))","v":""},"",""]
[null,{"$f":"IF($I98=\"\",\"\",CONCATENATE(\"rename \",TRIM($I98),\" \",$J98,\"_\",Cover!$C$14,\", replace\"))","v":""},null,95,{"$f":"IF(Variables!E97=\"\",\"\",Variables!E97)","v":""},{"$f":"IFERROR(INDEX(Variables!$B:$BY,MATCH($E98,Variables!$E:$E,0),MATCH(Cover!$C$14,Variables!$B$2:$BY$2,0)),\"\")","v":""},{"$f":"IF(E98=\"\",\"\",IF(F98=\"-\",\"N\",INDEX(Variables!$B:$BY,MATCH(E98,Variables!$E:$E,0),MATCH(\"Included?\",Variables!$B$2:$BY$2,0))))","v":""},{"$f":"IF(G98=\"\",\"\",COUNTIF($G$4:G98,\"Y\"))","v":""},"",""]
[null,{"$f":"IF($I99=\"\",\"\",CONCATENATE(\"rename \",TRIM($I99),\" \",$J99,\"_\",Cover!$C$14,\", replace\"))","v":""},null,96,{"$f":"IF(Variables!E98=\"\",\"\",Variables!E98)","v":""},{"$f":"IFERROR(INDEX(Variables!$B:$BY,MATCH($E99,Variables!$E:$E,0),MATCH(Cover!$C$14,Variables!$B$2:$BY$2,0)),\"\")","v":""},{"$f":"IF(E99=\"\",\"\",IF(F99=\"-\",\"N\",INDEX(Variables!$B:$BY,MATCH(E99,Variables!$E:$E,0),MATCH(\"Included?\",Variables!$B$2:$BY$2,0))))","v":""},{"$f":"IF(G99=\"\",\"\",COUNTIF($G$4:G99,\"Y\"))","v":""},"",""]
[null,{"$f":"IF($I100=\"\",\"\",CONCATENATE(\"rename \",TRIM($I100),\" \",$J100,\"_\",Cover!$C$14,\", replace\"))","v":""},null,97,{"$f":"IF(Variables!E99=\"\",\"\",Variables!E99)","v":""},{"$f":"IFERROR(INDEX(Variables!$B:$BY,MATCH($E100,Variables!$E:$E,0),MATCH(Cover!$C$14,Variables!$B$2:$BY$2,0)),\"\")","v":""},{"$f":"IF(E100=\"\",\"\",IF(F100=\"-\",\"N\",INDEX(Variables!$B:$BY,MATCH(E100,Variables!$E:$E,0),MATCH(\"Included?\",Variables!$B$2:$BY$2,0))))","v":""},{"$f":"IF(G100=\"\",\"\",COUNTIF($G$4:G100,\"Y\"))","v":""},"",""]
[null,{"$f":"IF($I101=\"\",\"\",CONCATENATE(\"rename \",TRIM($I101),\" \",$J101,\"_\",Cover!$C$14,\", replace\"))","v":""},null,98,{"$f":"IF(Variables!E100=\"\",\"\",Variables!E100)","v":""},{"$f":"IFERROR(INDEX(Variables!$B:$BY,MATCH($E101,Variables!$E:$E,0),MATCH(Cover!$C$14,Variables!$B$2:$BY$2,0)),\"\")","v":""},{"$f":"IF(E101=\"\",\"\",IF(F101=\"-\",\"N\",INDEX(Variables!$B:$BY,MATCH(E101,Variables!$E:$E,0),MATCH(\"Included?\",Variables!$B$2:$BY$2,0))))","v":""},{"$f":"IF(G101=\"\",\"\",COUNTIF($G$4:G101,\"Y\"))","v":""},"",""]
[null,{"$f":"IF($I102=\"\",\"\",CONCATENATE(\"rename \",TRIM($I102),\" \",$J102,\"_\",Cover!$C$14,\", replace\"))","v":""},null,99,{"$f":"IF(Variables!E101=\"\",\"\",Variables!E101)","v":""},{"$f":"IFERROR(INDEX(Variables!$B:$BY,MATCH($E102,Variables!$E:$E,0),MATCH(Cover!$C$14,Variables!$B$2:$BY$2,0)),\"\")","v":""},{"$f":"IF(E102=\"\",\"\",IF(F102=\"-\",\"N\",INDEX(Variables!$B:$BY,MATCH(E102,Variables!$E:$E,0),MATCH(\"Included?\",Variables!$B$2:$BY$2,0))))","v":""},{"$f":"IF(G102=\"\",\"\",COUNTIF($G$4:G102,\"Y\"))","v":""},"",""]
[null,{"$f":"IF($I103=\"\",\"\",CONCATENATE(\"rename \",TRIM($I103),\" \",$J103,\"_\",Cover!$C$14,\", replace\"))","v":""},null,100,{"$f":"IF(Variables!E102=\"\",\"\",Variables!E102)","v":""},{"$f":"IFERROR(INDEX(Variables!$B:$BY,MATCH($E103,Variables!$E:$E,0),MATCH(Cover!$C$14,Variables!$B$2:$BY$2,0)),\"\")","v":""},{"$f":"IF(E103=\"\",\"\",IF(F103=\"-\",\"N\",INDEX(Variables!$B:$BY,MATCH(E103,Variables!$E:$E,0),MATCH(\"Included?\",Variables!$B$2:$BY$2,0))))","v":""},{"$f":"IF(G103=\"\",\"\",COUNTIF($G$4:G103,\"Y\"))","v":""},"",""]

{"sheet":"Clean","index":4,"n_rows":103,"n_cols":12,"rows_kept":103,"cut":false,"hidden":false,"merged":[[1,3,1,11]]}
[]
[null,"Clean Variables (Stata Code)",null,"Input Calculations"]
[null,{"$f":"CONCATENATE(\"*** Clean \",Cover!$C$14,\" Variables\")","v":"*** Clean 1968 Variables"},null,"#","Variable Name","Error Code","Action","Full Variable Name","Replace with","Cond. Code if List","Numeric","Final Conditional"]
[null,{"$f":"IF(E4=\"\",\"\",CONCATENATE(\"replace \",H4,\" = \",I4,\" if \",L4))","v":"replace age1_1968 = . if age1_1968 == 98"},null,1,{"$f":"IFERROR(TRIM(INDEX('Error Codes'!$B:$AT,MATCH($D4,'Error Codes'!$G:$G,0),MATCH($E$3,'Error Codes'!$B$2:$AT$2,0))),\"\")","v":"age1"},{"$f":"IFERROR(TRIM(INDEX('Error Codes'!$B:$AT,MATCH($D4,'Error Codes'!$G:$G,0),MATCH(Cover!$C$14,'Error Codes'!$B$2:$AT$2,0))),\"\")","v":"98"},{"$f":"IFERROR(INDEX('Error Codes'!$B:$AT,MATCH($D4,'Error Codes'!$G:$G,0),MATCH($G$3,'Error Codes'!$B$2:$AT$2,0)),\"\")","v":"Drop"},{"$f":"IF(E4=\"\",\"\",CONCATENATE(E4,\"_\",Cover!$C$14))","v":"age1_1968"},{"$f":"IF(G4=\"\",\"\",IF(G4=\"Drop\",\".\",0))","v":"."},{"$f":"IF(H4=\"\",\"\",CONCATENATE(\"inlist(\",H4,\", \",F4,\")\"))","v":"inlist(age1_1968, 98)"},{"$f":"IF(H4=\"\",\"\",IFERROR(VALUE(F4),\"NA\"))","v":98},{"$f":"IF(H4=\"\",\"\",IF(K4=\"NA\",J4,CONCATENATE(H4,\" == \",K4)))","v":"age1_1968 == 98"}]
[null,{"$f":"IF(E5=\"\",\"\",CONCATENATE(\"replace \",H5,\" = \",I5,\" if \",L5))","v":"replace age1_1968 = . if age1_1968 == 99"},null,2,{"$f":"IFERROR(TRIM(INDEX('Error Codes'!$B:$AT,MATCH($D5,'Error Codes'!$G:$G,0),MATCH($E$3,'Error Codes'!$B$2:$AT$2,0))),\"\")","v":"age1"},{"$f":"IFERROR(TRIM(INDEX('Error Codes'!$B:$AT,MATCH($D5,'Error Codes'!$G:$G,0),MATCH(Cover!$C$14,'Error Codes'!$B$2:$AT$2,0))),\"\")","v":"99"},{"$f":"IFERROR(INDEX('Error Codes'!$B:$AT,MATCH($D5,'Error Codes'!$G:$G,0),MATCH($G$3,'Error Codes'!$B$2:$AT$2,0)),\"\")","v":"Drop"},{"$f":"IF(E5=\"\",\"\",CONCATENATE(E5,\"_\",Cover!$C$14))","v":"age1_1968"},{"$f":"IF(G5=\"\",\"\",IF(G5=\"Drop\",\".\",0))","v":"."},{"$f":"IF(H5=\"\",\"\",CONCATENATE(\"inlist(\",H5,\", \",F5,\")\"))","v":"inlist(age1_1968, 99)"},{"$f":"IF(H5=\"\",\"\",IFERROR(VALUE(F5),\"NA\"))","v":99},{"$f":"IF(H5=\"\",\"\",IF(K5=\"NA\",J5,CONCATENATE(H5,\" == \",K5)))","v":"age1_1968 == 99"}]
[null,"replace age2_1968 = . if age2_1968 == 99",null,3,{"$f":"IFERROR(TRIM(INDEX('Error Codes'!$B:$AT,MATCH($D6,'Error Codes'!$G:$G,0),MATCH($E$3,'Error Codes'!$B$2:$AT$2,0))),\"\")","v":"age2"},{"$f":"IFERROR(TRIM(INDEX('Error Codes'!$B:$AT,MATCH($D6,'Error Codes'!$G:$G,0),MATCH(Cover!$C$14,'Error Codes'!$B$2:$AT$2,0))),\"\")","v":"99"},{"$f":"IFERROR(INDEX('Error Codes'!$B:$AT,MATCH($D6,'Error Codes'!$G:$G,0),MATCH($G$3,'Error Codes'!$B$2:$AT$2,0)),\"\")","v":"Drop"},{"$f":"IF(E6=\"\",\"\",CONCATENATE(E6,\"_\",Cover!$C$14))","v":"age2_1968"},".","inlist(age2_1968, 99)",99,"age2_1968 == 99"]
[null,"replace num_dep3_1968 = 0 if num_dep3_1968 == 9",null,4,{"$f":"IFERROR(TRIM(INDEX('Error Codes'!$B:$AT,MATCH($D7,'Error Codes'!$G:$G,0),MATCH($E$3,'Error Codes'!$B$2:$AT$2,0))),\"\")","v":"num_dep3"},{"$f":"IFERROR(TRIM(INDEX('Error Codes'!$B:$AT,MATCH($D7,'Error Codes'!$G:$G,0),MATCH(Cover!$C$14,'Error Codes'!$B$2:$AT$2,0))),\"\")","v":"9"},{"$f":"IFERROR(INDEX('Error Codes'!$B:$AT,MATCH($D7,'Error Codes'!$G:$G,0),MATCH($G$3,'Error Codes'!$B$2:$AT$2,0)),\"\")","v":"Replace with 0"},{"$f":"IF(E7=\"\",\"\",CONCATENATE(E7,\"_\",Cover!$C$14))","v":"num_dep3_1968"},0,"inlist(num_dep3_1968, 9)",9,"num_dep3_1968 == 9"]
[null,"replace mstat2_1968 = . if mstat2_1968 == 9",null,5,{"$f":"IFERROR(TRIM(INDEX('Error Codes'!$B:$AT,MATCH($D8,'Error Codes'!$G:$G,0),MATCH($E$3,'Error Codes'!$B$2:$AT$2,0))),\"\")","v":"mstat2"},{"$f":"IFERROR(TRIM(INDEX('Error Codes'!$B:$AT,MATCH($D8,'Error Codes'!$G:$G,0),MATCH(Cover!$C$14,'Error Codes'!$B$2:$AT$2,0))),\"\")","v":"9"},{"$f":"IFERROR(INDEX('Error Codes'!$B:$AT,MATCH($D8,'Error Codes'!$G:$G,0),MATCH($G$3,'Error Codes'!$B$2:$AT$2,0)),\"\")","v":"Drop"},{"$f":"IF(E8=\"\",\"\",CONCATENATE(E8,\"_\",Cover!$C$14))","v":"mstat2_1968"},".","inlist(mstat2_1968, 9)",9,"mstat2_1968 == 9"]
[null,"replace state1_1968 = . if state1_1968 == 99",null,6,{"$f":"IFERROR(TRIM(INDEX('Error Codes'!$B:$AT,MATCH($D9,'Error Codes'!$G:$G,0),MATCH($E$3,'Error Codes'!$B$2:$AT$2,0))),\"\")","v":"state1"},{"$f":"IFERROR(TRIM(INDEX('Error Codes'!$B:$AT,MATCH($D9,'Error Codes'!$G:$G,0),MATCH(Cover!$C$14,'Error Codes'!$B$2:$AT$2,0))),\"\")","v":"99"},{"$f":"IFERROR(INDEX('Error Codes'!$B:$AT,MATCH($D9,'Error Codes'!$G:$G,0),MATCH($G$3,'Error Codes'!$B$2:$AT$2,0)),\"\")","v":"Drop"},{"$f":"IF(E9=\"\",\"\",CONCATENATE(E9,\"_\",Cover!$C$14))","v":"state1_1968"},".","inlist(state1_1968, 99)",99,"state1_1968 == 99"]
[null,"",null,7,{"$f":"IFERROR(TRIM(INDEX('Error Codes'!$B:$AT,MATCH($D10,'Error Codes'!$G:$G,0),MATCH($E$3,'Error Codes'!$B$2:$AT$2,0))),\"\")","v":""},{"$f":"IFERROR(TRIM(INDEX('Error Codes'!$B:$AT,MATCH($D10,'Error Codes'!$G:$G,0),MATCH(Cover!$C$14,'Error Codes'!$B$2:$AT$2,0))),\"\")","v":""},{"$f":"IFERROR(INDEX('Error Codes'!$B:$AT,MATCH($D10,'Error Codes'!$G:$G,0),MATCH($G$3,'Error Codes'!$B$2:$AT$2,0)),\"\")","v":""},{"$f":"IF(E10=\"\",\"\",CONCATENATE(E10,\"_\",Cover!$C$14))","v":""},"","","",""]
[null,"",null,8,{"$f":"IFERROR(TRIM(INDEX('Error Codes'!$B:$AT,MATCH($D11,'Error Codes'!$G:$G,0),MATCH($E$3,'Error Codes'!$B$2:$AT$2,0))),\"\")","v":""},{"$f":"IFERROR(TRIM(INDEX('Error Codes'!$B:$AT,MATCH($D11,'Error Codes'!$G:$G,0),MATCH(Cover!$C$14,'Error Codes'!$B$2:$AT$2,0))),\"\")","v":""},{"$f":"IFERROR(INDEX('Error Codes'!$B:$AT,MATCH($D11,'Error Codes'!$G:$G,0),MATCH($G$3,'Error Codes'!$B$2:$AT$2,0)),\"\")","v":""},{"$f":"IF(E11=\"\",\"\",CONCATENATE(E11,\"_\",Cover!$C$14))","v":""},"","","",""]
[null,"",null,9,{"$f":"IFERROR(TRIM(INDEX('Error Codes'!$B:$AT,MATCH($D12,'Error Codes'!$G:$G,0),MATCH($E$3,'Error Codes'!$B$2:$AT$2,0))),\"\")","v":""},{"$f":"IFERROR(TRIM(INDEX('Error Codes'!$B:$AT,MATCH($D12,'Error Codes'!$G:$G,0),MATCH(Cover!$C$14,'Error Codes'!$B$2:$AT$2,0))),\"\")","v":""},{"$f":"IFERROR(INDEX('Error Codes'!$B:$AT,MATCH($D12,'Error Codes'!$G:$G,0),MATCH($G$3,'Error Codes'!$B$2:$AT$2,0)),\"\")","v":""},{"$f":"IF(E12=\"\",\"\",CONCATENATE(E12,\"_\",Cover!$C$14))","v":""},"","","",""]
[null,"",null,10,{"$f":"IFERROR(TRIM(INDEX('Error Codes'!$B:$AT,MATCH($D13,'Error Codes'!$G:$G,0),MATCH($E$3,'Error Codes'!$B$2:$AT$2,0))),\"\")","v":""},{"$f":"IFERROR(TRIM(INDEX('Error Codes'!$B:$AT,MATCH($D13,'Error Codes'!$G:$G,0),MATCH(Cover!$C$14,'Error Codes'!$B$2:$AT$2,0))),\"\")","v":""},{"$f":"IFERROR(INDEX('Error Codes'!$B:$AT,MATCH($D13,'Error Codes'!$G:$G,0),MATCH($G$3,'Error Codes'!$B$2:$AT$2,0)),\"\")","v":""},{"$f":"IF(E13=\"\",\"\",CONCATENATE(E13,\"_\",Cover!$C$14))","v":""},"","","",""]
[null,"",null,11,{"$f":"IFERROR(TRIM(INDEX('Error Codes'!$B:$AT,MATCH($D14,'Error Codes'!$G:$G,0),MATCH($E$3,'Error Codes'!$B$2:$AT$2,0))),\"\")","v":""},{"$f":"IFERROR(TRIM(INDEX('Error Codes'!$B:$AT,MATCH($D14,'Error Codes'!$G:$G,0),MATCH(Cover!$C$14,'Error Codes'!$B$2:$AT$2,0))),\"\")","v":""},{"$f":"IFERROR(INDEX('Error Codes'!$B:$AT,MATCH($D14,'Error Codes'!$G:$G,0),MATCH($G$3,'Error Codes'!$B$2:$AT$2,0)),\"\")","v":""},{"$f":"IF(E14=\"\",\"\",CONCATENATE(E14,\"_\",Cover!$C$14))","v":""},"","","",""]
[null,"",null,12,{"$f":"IFERROR(TRIM(INDEX('Error Codes'!$B:$AT,MATCH($D15,'Error Codes'!$G:$G,0),MATCH($E$3,'Error Codes'!$B$2:$AT$2,0))),\"\")","v":""},{"$f":"IFERROR(TRIM(INDEX('Error Codes'!$B:$AT,MATCH($D15,'Error Codes'!$G:$G,0),MATCH(Cover!$C$14,'Error Codes'!$B$2:$AT$2,0))),\"\")","v":""},{"$f":"IFERROR(INDEX('Error Codes'!$B:$AT,MATCH($D15,'Error Codes'!$G:$G,0),MATCH($G$3,'Error Codes'!$B$2:$AT$2,0)),\"\")","v":""},{"$f":"IF(E15=\"\",\"\",CONCATENATE(E15,\"_\",Cover!$C$14))","v":""},"","","",""]
[null,"",null,13,{"$f":"IFERROR(TRIM(INDEX('Error Codes'!$B:$AT,MATCH($D16,'Error Codes'!$G:$G,0),MATCH($E$3,'Error Codes'!$B$2:$AT$2,0))),\"\")","v":""},{"$f":"IFERROR(TRIM(INDEX('Error Codes'!$B:$AT,MATCH($D16,'Error Codes'!$G:$G,0),MATCH(Cover!$C$14,'Error Codes'!$B$2:$AT$2,0))),\"\")","v":""},{"$f":"IFERROR(INDEX('Error Codes'!$B:$AT,MATCH($D16,'Error Codes'!$G:$G,0),MATCH($G$3,'Error Codes'!$B$2:$AT$2,0)),\"\")","v":""},{"$f":"IF(E16=\"\",\"\",CONCATENATE(E16,\"_\",Cover!$C$14))","v":""},"","","",""]
[null,"",null,14,{"$f":"IFERROR(TRIM(INDEX('Error Codes'!$B:$AT,MATCH($D17,'Error Codes'!$G:$G,0),MATCH($E$3,'Error Codes'!$B$2:$AT$2,0))),\"\")","v":""},{"$f":"IFERROR(TRIM(INDEX('Error Codes'!$B:$AT,MATCH($D17,'Error Codes'!$G:$G,0),MATCH(Cover!$C$14,'Error Codes'!$B$2:$AT$2,0))),\"\")","v":""},{"$f":"IFERROR(INDEX('Error Codes'!$B:$AT,MATCH($D17,'Error Codes'!$G:$G,0),MATCH($G$3,'Error Codes'!$B$2:$AT$2,0)),\"\")","v":""},{"$f":"IF(E17=\"\",\"\",CONCATENATE(E17,\"_\",Cover!$C$14))","v":""},"","","",""]
[null,"",null,15,{"$f":"IFERROR(TRIM(INDEX('Error Codes'!$B:$AT,MATCH($D18,'Error Codes'!$G:$G,0),MATCH($E$3,'Error Codes'!$B$2:$AT$2,0))),\"\")","v":""},{"$f":"IFERROR(TRIM(INDEX('Error Codes'!$B:$AT,MATCH($D18,'Error Codes'!$G:$G,0),MATCH(Cover!$C$14,'Error Codes'!$B$2:$AT$2,0))),\"\")","v":""},{"$f":"IFERROR(INDEX('Error Codes'!$B:$AT,MATCH($D18,'Error Codes'!$G:$G,0),MATCH($G$3,'Error Codes'!$B$2:$AT$2,0)),\"\")","v":""},{"$f":"IF(E18=\"\",\"\",CONCATENATE(E18,\"_\",Cover!$C$14))","v":""},"","","",""]
[null,"",null,16,{"$f":"IFERROR(TRIM(INDEX('Error Codes'!$B:$AT,MATCH($D19,'Error Codes'!$G:$G,0),MATCH($E$3,'Error Codes'!$B$2:$AT$2,0))),\"\")","v":""},{"$f":"IFERROR(TRIM(INDEX('Error Codes'!$B:$AT,MATCH($D19,'Error Codes'!$G:$G,0),MATCH(Cover!$C$14,'Error Codes'!$B$2:$AT$2,0))),\"\")","v":""},{"$f":"IFERROR(INDEX('Error Codes'!$B:$AT,MATCH($D19,'Error Codes'!$G:$G,0),MATCH($G$3,'Error Codes'!$B$2:$AT$2,0)),\"\")","v":""},{"$f":"IF(E19=\"\",\"\",CONCATENATE(E19,\"_\",Cover!$C$14))","v":""},"","","",""]
[null,"",null,17,{"$f":"IFERROR(TRIM(INDEX('Error Codes'!$B:$AT,MATCH($D20,'Error Codes'!$G:$G,0),MATCH($E$3,'Error Codes'!$B$2:$AT$2,0))),\"\")","v":""},{"$f":"IFERROR(TRIM(INDEX('Error Codes'!$B:$AT,MATCH($D20,'Error Codes'!$G:$G,0),MATCH(Cover!$C$14,'Error Codes'!$B$2:$AT$2,0))),\"\")","v":""},{"$f":"IFERROR(INDEX('Error Codes'!$B:$AT,MATCH($D20,'Error Codes'!$G:$G,0),MATCH($G$3,'Error Codes'!$B$2:$AT$2,0)),\"\")","v":""},{"$f":"IF(E20=\"\",\"\",CONCATENATE(E20,\"_\",Cover!$C$14))","v":""},"","","",""]
[null,"",null,18,{"$f":"IFERROR(TRIM(INDEX('Error Codes'!$B:$AT,MATCH($D21,'Error Codes'!$G:$G,0),MATCH($E$3,'Error Codes'!$B$2:$AT$2,0))),\"\")","v":""},{"$f":"IFERROR(TRIM(INDEX('Error Codes'!$B:$AT,MATCH($D21,'Error Codes'!$G:$G,0),MATCH(Cover!$C$14,'Error Codes'!$B$2:$AT$2,0))),\"\")","v":""},{"$f":"IFERROR(INDEX('Error Codes'!$B:$AT,MATCH($D21,'Error Codes'!$G:$G,0),MATCH($G$3,'Error Codes'!$B$2:$AT$2,0)),\"\")","v":""},{"$f":"IF(E21=\"\",\"\",CONCATENATE(E21,\"_\",Cover!$C$14))","v":""},"","","",""]
[null,"",null,19,{"$f":"IFERROR(TRIM(INDEX('Error Codes'!$B:$AT,MATCH($D22,'Error Codes'!$G:$G,0),MATCH($E$3,'Error Codes'!$B$2:$AT$2,0))),\"\")","v":""},{"$f":"IFERROR(TRIM(INDEX('Error Codes'!$B:$AT,MATCH($D22,'Error Codes'!$G:$G,0),MATCH(Cover!$C$14,'Error Codes'!$B$2:$AT$2,0))),\"\")","v":""},{"$f":"IFERROR(INDEX('Error Codes'!$B:$AT,MATCH($D22,'Error Codes'!$G:$G,0),MATCH($G$3,'Error Codes'!$B$2:$AT$2,0)),\"\")","v":""},{"$f":"IF(E22=\"\",\"\",CONCATENATE(E22,\"_\",Cover!$C$14))","v":""},"","","",""]
[null,"",null,20,{"$f":"IFERROR(TRIM(INDEX('Error Codes'!$B:$AT,MATCH($D23,'Error Codes'!$G:$G,0),MATCH($E$3,'Error Codes'!$B$2:$AT$2,0))),\"\")","v":""},{"$f":"IFERROR(TRIM(INDEX('Error Codes'!$B:$AT,MATCH($D23,'Error Codes'!$G:$G,0),MATCH(Cover!$C$14,'Error Codes'!$B$2:$AT$2,0))),\"\")","v":""},{"$f":"IFERROR(INDEX('Error Codes'!$B:$AT,MATCH($D23,'Error Codes'!$G:$G,0),MATCH($G$3,'Error Codes'!$B$2:$AT$2,0)),\"\")","v":""},{"$f":"IF(E23=\"\",\"\",CONCATENATE(E23,\"_\",Cover!$C$14))","v":""},"","","",""]
[null,"",null,21,{"$f":"IFERROR(TRIM(INDEX('Error Codes'!$B:$AT,MATCH($D24,'Error Codes'!$G:$G,0),MATCH($E$3,'Error Codes'!$B$2:$AT$2,0))),\"\")","v":""},{"$f":"IFERROR(TRIM(INDEX('Error Codes'!$B:$AT,MATCH($D24,'Error Codes'!$G:$G,0),MATCH(Cover!$C$14,'Error Codes'!$B$2:$AT$2,0))),\"\")","v":""},{"$f":"IFERROR(INDEX('Error Codes'!$B:$AT,MATCH($D24,'Error Codes'!$G:$G,0),MATCH($G$3,'Error Codes'!$B$2:$AT$2,0)),\"\")","v":""},{"$f":"IF(E24=\"\",\"\",CONCATENATE(E24,\"_\",Cover!$C$14))","v":""},"","","",""]
[null,"",null,22,{"$f":"IFERROR(TRIM(INDEX('Error Codes'!$B:$AT,MATCH($D25,'Error Codes'!$G:$G,0),MATCH($E$3,'Error Codes'!$B$2:$AT$2,0))),\"\")","v":""},{"$f":"IFERROR(TRIM(INDEX('Error Codes'!$B:$AT,MATCH($D25,'Error Codes'!$G:$G,0),MATCH(Cover!$C$14,'Error Codes'!$B$2:$AT$2,0))),\"\")","v":""},{"$f":"IFERROR(INDEX('Error Codes'!$B:$AT,MATCH($D25,'Error Codes'!$G:$G,0),MATCH($G$3,'Error Codes'!$B$2:$AT$2,0)),\"\")","v":""},{"$f":"IF(E25=\"\",\"\",CONCATENATE(E25,\"_\",Cover!$C$14))","v":""},"","","",""]
[null,"",null,23,{"$f":"IFERROR(TRIM(INDEX('Error Codes'!$B:$AT,MATCH($D26,'Error Codes'!$G:$G,0),MATCH($E$3,'Error Codes'!$B$2:$AT$2,0))),\"\")","v":""},{"$f":"IFERROR(TRIM(INDEX('Error Codes'!$B:$AT,MATCH($D26,'Error Codes'!$G:$G,0),MATCH(Cover!$C$14,'Error Codes'!$B$2:$AT$2,0))),\"\")","v":""},{"$f":"IFERROR(INDEX('Error Codes'!$B:$AT,MATCH($D26,'Error Codes'!$G:$G,0),MATCH($G$3,'Error Codes'!$B$2:$AT$2,0)),\"\")","v":""},{"$f":"IF(E26=\"\",\"\",CONCATENATE(E26,\"_\",Cover!$C$14))","v":""},"","","",""]
[null,"",null,24,{"$f":"IFERROR(TRIM(INDEX('Error Codes'!$B:$AT,MATCH($D27,'Error Codes'!$G:$G,0),MATCH($E$3,'Error Codes'!$B$2:$AT$2,0))),\"\")","v":""},{"$f":"IFERROR(TRIM(INDEX('Error Codes'!$B:$AT,MATCH($D27,'Error Codes'!$G:$G,0),MATCH(Cover!$C$14,'Error Codes'!$B$2:$AT$2,0))),\"\")","v":""},{"$f":"IFERROR(INDEX('Error Codes'!$B:$AT,MATCH($D27,'Error Codes'!$G:$G,0),MATCH($G$3,'Error Codes'!$B$2:$AT$2,0)),\"\")","v":""},{"$f":"IF(E27=\"\",\"\",CONCATENATE(E27,\"_\",Cover!$C$14))","v":""},"","","",""]
[null,"",null,25,{"$f":"IFERROR(TRIM(INDEX('Error Codes'!$B:$AT,MATCH($D28,'Error Codes'!$G:$G,0),MATCH($E$3,'Error Codes'!$B$2:$AT$2,0))),\"\")","v":""},{"$f":"IFERROR(TRIM(INDEX('Error Codes'!$B:$AT,MATCH($D28,'Error Codes'!$G:$G,0),MATCH(Cover!$C$14,'Error Codes'!$B$2:$AT$2,0))),\"\")","v":""},{"$f":"IFERROR(INDEX('Error Codes'!$B:$AT,MATCH($D28,'Error Codes'!$G:$G,0),MATCH($G$3,'Error Codes'!$B$2:$AT$2,0)),\"\")","v":""},{"$f":"IF(E28=\"\",\"\",CONCATENATE(E28,\"_\",Cover!$C$14))","v":""},"","","",""]
[null,"",null,26,{"$f":"IFERROR(TRIM(INDEX('Error Codes'!$B:$AT,MATCH($D29,'Error Codes'!$G:$G,0),MATCH($E$3,'Error Codes'!$B$2:$AT$2,0))),\"\")","v":""},{"$f":"IFERROR(TRIM(INDEX('Error Codes'!$B:$AT,MATCH($D29,'Error Codes'!$G:$G,0),MATCH(Cover!$C$14,'Error Codes'!$B$2:$AT$2,0))),\"\")","v":""},{"$f":"IFERROR(INDEX('Error Codes'!$B:$AT,MATCH($D29,'Error Codes'!$G:$G,0),MATCH($G$3,'Error Codes'!$B$2:$AT$2,0)),\"\")","v":""},{"$f":"IF(E29=\"\",\"\",CONCATENATE(E29,\"_\",Cover!$C$14))","v":""},"","","",""]
[null,"",null,27,{"$f":"IFERROR(TRIM(INDEX('Error Codes'!$B:$AT,MATCH($D30,'Error Codes'!$G:$G,0),MATCH($E$3,'Error Codes'!$B$2:$AT$2,0))),\"\")","v":""},{"$f":"IFERROR(TRIM(INDEX('Error Codes'!$B:$AT,MATCH($D30,'Error Codes'!$G:$G,0),MATCH(Cover!$C$14,'Error Codes'!$B$2:$AT$2,0))),\"\")","v":""},{"$f":"IFERROR(INDEX('Error Codes'!$B:$AT,MATCH($D30,'Error Codes'!$G:$G,0),MATCH($G$3,'Error Codes'!$B$2:$AT$2,0)),\"\")","v":""},{"$f":"IF(E30=\"\",\"\",CONCATENATE(E30,\"_\",Cover!$C$14))","v":""},"","","",""]
[null,"",null,28,{"$f":"IFERROR(TRIM(INDEX('Error Codes'!$B:$AT,MATCH($D31,'Error Codes'!$G:$G,0),MATCH($E$3,'Error Codes'!$B$2:$AT$2,0))),\"\")","v":""},{"$f":"IFERROR(TRIM(INDEX('Error Codes'!$B:$AT,MATCH($D31,'Error Codes'!$G:$G,0),MATCH(Cover!$C$14,'Error Codes'!$B$2:$AT$2,0))),\"\")","v":""},{"$f":"IFERROR(INDEX('Error Codes'!$B:$AT,MATCH($D31,'Error Codes'!$G:$G,0),MATCH($G$3,'Error Codes'!$B$2:$AT$2,0)),\"\")","v":""},{"$f":"IF(E31=\"\",\"\",CONCATENATE(E31,\"_\",Cover!$C$14))","v":""},"","","",""]
[null,"",null,29,{"$f":"IFERROR(TRIM(INDEX('Error Codes'!$B:$AT,MATCH($D32,'Error Codes'!$G:$G,0),MATCH($E$3,'Error Codes'!$B$2:$AT$2,0))),\"\")","v":""},{"$f":"IFERROR(TRIM(INDEX('Error Codes'!$B:$AT,MATCH($D32,'Error Codes'!$G:$G,0),MATCH(Cover!$C$14,'Error Codes'!$B$2:$AT$2,0))),\"\")","v":""},{"$f":"IFERROR(INDEX('Error Codes'!$B:$AT,MATCH($D32,'Error Codes'!$G:$G,0),MATCH($G$3,'Error Codes'!$B$2:$AT$2,0)),\"\")","v":""},{"$f":"IF(E32=\"\",\"\",CONCATENATE(E32,\"_\",Cover!$C$14))","v":""},"","","",""]
[null,"",null,30,{"$f":"IFERROR(TRIM(INDEX('Error Codes'!$B:$AT,MATCH($D33,'Error Codes'!$G:$G,0),MATCH($E$3,'Error Codes'!$B$2:$AT$2,0))),\"\")","v":""},{"$f":"IFERROR(TRIM(INDEX('Error Codes'!$B:$AT,MATCH($D33,'Error Codes'!$G:$G,0),MATCH(Cover!$C$14,'Error Codes'!$B$2:$AT$2,0))),\"\")","v":""},{"$f":"IFERROR(INDEX('Error Codes'!$B:$AT,MATCH($D33,'Error Codes'!$G:$G,0),MATCH($G$3,'Error Codes'!$B$2:$AT$2,0)),\"\")","v":""},{"$f":"IF(E33=\"\",\"\",CONCATENATE(E33,\"_\",Cover!$C$14))","v":""},"","","",""]
[null,"",null,31,{"$f":"IFERROR(TRIM(INDEX('Error Codes'!$B:$AT,MATCH($D34,'Error Codes'!$G:$G,0),MATCH($E$3,'Error Codes'!$B$2:$AT$2,0))),\"\")","v":""},{"$f":"IFERROR(TRIM(INDEX('Error Codes'!$B:$AT,MATCH($D34,'Error Codes'!$G:$G,0),MATCH(Cover!$C$14,'Error Codes'!$B$2:$AT$2,0))),\"\")","v":""},{"$f":"IFERROR(INDEX('Error Codes'!$B:$AT,MATCH($D34,'Error Codes'!$G:$G,0),MATCH($G$3,'Error Codes'!$B$2:$AT$2,0)),\"\")","v":""},{"$f":"IF(E34=\"\",\"\",CONCATENATE(E34,\"_\",Cover!$C$14))","v":""},"","","",""]
[null,"",null,32,{"$f":"IFERROR(TRIM(INDEX('Error Codes'!$B:$AT,MATCH($D35,'Error Codes'!$G:$G,0),MATCH($E$3,'Error Codes'!$B$2:$AT$2,0))),\"\")","v":""},{"$f":"IFERROR(TRIM(INDEX('Error Codes'!$B:$AT,MATCH($D35,'Error Codes'!$G:$G,0),MATCH(Cover!$C$14,'Error Codes'!$B$2:$AT$2,0))),\"\")","v":""},{"$f":"IFERROR(INDEX('Error Codes'!$B:$AT,MATCH($D35,'Error Codes'!$G:$G,0),MATCH($G$3,'Error Codes'!$B$2:$AT$2,0)),\"\")","v":""},{"$f":"IF(E35=\"\",\"\",CONCATENATE(E35,\"_\",Cover!$C$14))","v":""},"","","",""]
[null,"",null,33,{"$f":"IFERROR(TRIM(INDEX('Error Codes'!$B:$AT,MATCH($D36,'Error Codes'!$G:$G,0),MATCH($E$3,'Error Codes'!$B$2:$AT$2,0))),\"\")","v":""},{"$f":"IFERROR(TRIM(INDEX('Error Codes'!$B:$AT,MATCH($D36,'Error Codes'!$G:$G,0),MATCH(Cover!$C$14,'Error Codes'!$B$2:$AT$2,0))),\"\")","v":""},{"$f":"IFERROR(INDEX('Error Codes'!$B:$AT,MATCH($D36,'Error Codes'!$G:$G,0),MATCH($G$3,'Error Codes'!$B$2:$AT$2,0)),\"\")","v":""},{"$f":"IF(E36=\"\",\"\",CONCATENATE(E36,\"_\",Cover!$C$14))","v":""},"","","",""]
[null,"",null,34,{"$f":"IFERROR(TRIM(INDEX('Error Codes'!$B:$AT,MATCH($D37,'Error Codes'!$G:$G,0),MATCH($E$3,'Error Codes'!$B$2:$AT$2,0))),\"\")","v":""},{"$f":"IFERROR(TRIM(INDEX('Error Codes'!$B:$AT,MATCH($D37,'Error Codes'!$G:$G,0),MATCH(Cover!$C$14,'Error Codes'!$B$2:$AT$2,0))),\"\")","v":""},{"$f":"IFERROR(INDEX('Error Codes'!$B:$AT,MATCH($D37,'Error Codes'!$G:$G,0),MATCH($G$3,'Error Codes'!$B$2:$AT$2,0)),\"\")","v":""},{"$f":"IF(E37=\"\",\"\",CONCATENATE(E37,\"_\",Cover!$C$14))","v":""},"","","",""]
[null,"",null,35,{"$f":"IFERROR(TRIM(INDEX('Error Codes'!$B:$AT,MATCH($D38,'Error Codes'!$G:$G,0),MATCH($E$3,'Error Codes'!$B$2:$AT$2,0))),\"\")","v":""},{"$f":"IFERROR(TRIM(INDEX('Error Codes'!$B:$AT,MATCH($D38,'Error Codes'!$G:$G,0),MATCH(Cover!$C$14,'Error Codes'!$B$2:$AT$2,0))),\"\")","v":""},{"$f":"IFERROR(INDEX('Error Codes'!$B:$AT,MATCH($D38,'Error Codes'!$G:$G,0),MATCH($G$3,'Error Codes'!$B$2:$AT$2,0)),\"\")","v":""},{"$f":"IF(E38=\"\",\"\",CONCATENATE(E38,\"_\",Cover!$C$14))","v":""},"","","",""]
[null,"",null,36,{"$f":"IFERROR(TRIM(INDEX('Error Codes'!$B:$AT,MATCH($D39,'Error Codes'!$G:$G,0),MATCH($E$3,'Error Codes'!$B$2:$AT$2,0))),\"\")","v":""},{"$f":"IFERROR(TRIM(INDEX('Error Codes'!$B:$AT,MATCH($D39,'Error Codes'!$G:$G,0),MATCH(Cover!$C$14,'Error Codes'!$B$2:$AT$2,0))),\"\")","v":""},{"$f":"IFERROR(INDEX('Error Codes'!$B:$AT,MATCH($D39,'Error Codes'!$G:$G,0),MATCH($G$3,'Error Codes'!$B$2:$AT$2,0)),\"\")","v":""},{"$f":"IF(E39=\"\",\"\",CONCATENATE(E39,\"_\",Cover!$C$14))","v":""},"","","",""]
[null,"",null,37,{"$f":"IFERROR(TRIM(INDEX('Error Codes'!$B:$AT,MATCH($D40,'Error Codes'!$G:$G,0),MATCH($E$3,'Error Codes'!$B$2:$AT$2,0))),\"\")","v":""},{"$f":"IFERROR(TRIM(INDEX('Error Codes'!$B:$AT,MATCH($D40,'Error Codes'!$G:$G,0),MATCH(Cover!$C$14,'Error Codes'!$B$2:$AT$2,0))),\"\")","v":""},{"$f":"IFERROR(INDEX('Error Codes'!$B:$AT,MATCH($D40,'Error Codes'!$G:$G,0),MATCH($G$3,'Error Codes'!$B$2:$AT$2,0)),\"\")","v":""},{"$f":"IF(E40=\"\",\"\",CONCATENATE(E40,\"_\",Cover!$C$14))","v":""},"","","",""]
[null,"",null,38,{"$f":"IFERROR(TRIM(INDEX('Error Codes'!$B:$AT,MATCH($D41,'Error Codes'!$G:$G,0),MATCH($E$3,'Error Codes'!$B$2:$AT$2,0))),\"\")","v":""},{"$f":"IFERROR(TRIM(INDEX('Error Codes'!$B:$AT,MATCH($D41,'Error Codes'!$G:$G,0),MATCH(Cover!$C$14,'Error Codes'!$B$2:$AT$2,0))),\"\")","v":""},{"$f":"IFERROR(INDEX('Error Codes'!$B:$AT,MATCH($D41,'Error Codes'!$G:$G,0),MATCH($G$3,'Error Codes'!$B$2:$AT$2,0)),\"\")","v":""},{"$f":"IF(E41=\"\",\"\",CONCATENATE(E41,\"_\",Cover!$C$14))","v":""},"","","",""]
[null,"",null,39,{"$f":"IFERROR(TRIM(INDEX('Error Codes'!$B:$AT,MATCH($D42,'Error Codes'!$G:$G,0),MATCH($E$3,'Error Codes'!$B$2:$AT$2,0))),\"\")","v":""},{"$f":"IFERROR(TRIM(INDEX('Error Codes'!$B:$AT,MATCH($D42,'Error Codes'!$G:$G,0),MATCH(Cover!$C$14,'Error Codes'!$B$2:$AT$2,0))),\"\")","v":""},{"$f":"IFERROR(INDEX('Error Codes'!$B:$AT,MATCH($D42,'Error Codes'!$G:$G,0),MATCH($G$3,'Error Codes'!$B$2:$AT$2,0)),\"\")","v":""},{"$f":"IF(E42=\"\",\"\",CONCATENATE(E42,\"_\",Cover!$C$14))","v":""},"","","",""]
[null,"",null,40,{"$f":"IFERROR(TRIM(INDEX('Error Codes'!$B:$AT,MATCH($D43,'Error Codes'!$G:$G,0),MATCH($E$3,'Error Codes'!$B$2:$AT$2,0))),\"\")","v":""},{"$f":"IFERROR(TRIM(INDEX('Error Codes'!$B:$AT,MATCH($D43,'Error Codes'!$G:$G,0),MATCH(Cover!$C$14,'Error Codes'!$B$2:$AT$2,0))),\"\")","v":""},{"$f":"IFERROR(INDEX('Error Codes'!$B:$AT,MATCH($D43,'Error Codes'!$G:$G,0),MATCH($G$3,'Error Codes'!$B$2:$AT$2,0)),\"\")","v":""},{"$f":"IF(E43=\"\",\"\",CONCATENATE(E43,\"_\",Cover!$C$14))","v":""},"","","",""]
[null,"",null,41,{"$f":"IFERROR(TRIM(INDEX('Error Codes'!$B:$AT,MATCH($D44,'Error Codes'!$G:$G,0),MATCH($E$3,'Error Codes'!$B$2:$AT$2,0))),\"\")","v":""},{"$f":"IFERROR(TRIM(INDEX('Error Codes'!$B:$AT,MATCH($D44,'Error Codes'!$G:$G,0),MATCH(Cover!$C$14,'Error Codes'!$B$2:$AT$2,0))),\"\")","v":""},{"$f":"IFERROR(INDEX('Error Codes'!$B:$AT,MATCH($D44,'Error Codes'!$G:$G,0),MATCH($G$3,'Error Codes'!$B$2:$AT$2,0)),\"\")","v":""},{"$f":"IF(E44=\"\",\"\",CONCATENATE(E44,\"_\",Cover!$C$14))","v":""},"","","",""]
[null,"",null,42,{"$f":"IFERROR(TRIM(INDEX('Error Codes'!$B:$AT,MATCH($D45,'Error Codes'!$G:$G,0),MATCH($E$3,'Error Codes'!$B$2:$AT$2,0))),\"\")","v":""},{"$f":"IFERROR(TRIM(INDEX('Error Codes'!$B:$AT,MATCH($D45,'Error Codes'!$G:$G,0),MATCH(Cover!$C$14,'Error Codes'!$B$2:$AT$2,0))),\"\")","v":""},{"$f":"IFERROR(INDEX('Error Codes'!$B:$AT,MATCH($D45,'Error Codes'!$G:$G,0),MATCH($G$3,'Error Codes'!$B$2:$AT$2,0)),\"\")","v":""},{"$f":"IF(E45=\"\",\"\",CONCATENATE(E45,\"_\",Cover!$C$14))","v":""},"","","",""]
[null,"",null,43,{"$f":"IFERROR(TRIM(INDEX('Error Codes'!$B:$AT,MATCH($D46,'Error Codes'!$G:$G,0),MATCH($E$3,'Error Codes'!$B$2:$AT$2,0))),\"\")","v":""},{"$f":"IFERROR(TRIM(INDEX('Error Codes'!$B:$AT,MATCH($D46,'Error Codes'!$G:$G,0),MATCH(Cover!$C$14,'Error Codes'!$B$2:$AT$2,0))),\"\")","v":""},{"$f":"IFERROR(INDEX('Error Codes'!$B:$AT,MATCH($D46,'Error Codes'!$G:$G,0),MATCH($G$3,'Error Codes'!$B$2:$AT$2,0)),\"\")","v":""},{"$f":"IF(E46=\"\",\"\",CONCATENATE(E46,\"_\",Cover!$C$14))","v":""},"","","",""]
[null,"",null,44,{"$f":"IFERROR(TRIM(INDEX('Error Codes'!$B:$AT,MATCH($D47,'Error Codes'!$G:$G,0),MATCH($E$3,'Error Codes'!$B$2:$AT$2,0))),\"\")","v":""},{"$f":"IFERROR(TRIM(INDEX('Error Codes'!$B:$AT,MATCH($D47,'Error Codes'!$G:$G,0),MATCH(Cover!$C$14,'Error Codes'!$B$2:$AT$2,0))),\"\")","v":""},{"$f":"IFERROR(INDEX('Error Codes'!$B:$AT,MATCH($D47,'Error Codes'!$G:$G,0),MATCH($G$3,'Error Codes'!$B$2:$AT$2,0)),\"\")","v":""},{"$f":"IF(E47=\"\",\"\",CONCATENATE(E47,\"_\",Cover!$C$14))","v":""},"","","",""]
[null,"",null,45,{"$f":"IFERROR(TRIM(INDEX('Error Codes'!$B:$AT,MATCH($D48,'Error Codes'!$G:$G,0),MATCH($E$3,'Error Codes'!$B$2:$AT$2,0))),\"\")","v":""},{"$f":"IFERROR(TRIM(INDEX('Error Codes'!$B:$AT,MATCH($D48,'Error Codes'!$G:$G,0),MATCH(Cover!$C$14,'Error Codes'!$B$2:$AT$2,0))),\"\")","v":""},{"$f":"IFERROR(INDEX('Error Codes'!$B:$AT,MATCH($D48,'Error Codes'!$G:$G,0),MATCH($G$3,'Error Codes'!$B$2:$AT$2,0)),\"\")","v":""},{"$f":"IF(E48=\"\",\"\",CONCATENATE(E48,\"_\",Cover!$C$14))","v":""},"","","",""]
[null,"",null,46,{"$f":"IFERROR(TRIM(INDEX('Error Codes'!$B:$AT,MATCH($D49,'Error Codes'!$G:$G,0),MATCH($E$3,'Error Codes'!$B$2:$AT$2,0))),\"\")","v":""},{"$f":"IFERROR(TRIM(INDEX('Error Codes'!$B:$AT,MATCH($D49,'Error Codes'!$G:$G,0),MATCH(Cover!$C$14,'Error Codes'!$B$2:$AT$2,0))),\"\")","v":""},{"$f":"IFERROR(INDEX('Error Codes'!$B:$AT,MATCH($D49,'Error Codes'!$G:$G,0),MATCH($G$3,'Error Codes'!$B$2:$AT$2,0)),\"\")","v":""},{"$f":"IF(E49=\"\",\"\",CONCATENATE(E49,\"_\",Cover!$C$14))","v":""},"","","",""]
[null,"",null,47,{"$f":"IFERROR(TRIM(INDEX('Error Codes'!$B:$AT,MATCH($D50,'Error Codes'!$G:$G,0),MATCH($E$3,'Error Codes'!$B$2:$AT$2,0))),\"\")","v":""},{"$f":"IFERROR(TRIM(INDEX('Error Codes'!$B:$AT,MATCH($D50,'Error Codes'!$G:$G,0),MATCH(Cover!$C$14,'Error Codes'!$B$2:$AT$2,0))),\"\")","v":""},{"$f":"IFERROR(INDEX('Error Codes'!$B:$AT,MATCH($D50,'Error Codes'!$G:$G,0),MATCH($G$3,'Error Codes'!$B$2:$AT$2,0)),\"\")","v":""},{"$f":"IF(E50=\"\",\"\",CONCATENATE(E50,\"_\",Cover!$C$14))","v":""},"","","",""]
[null,"",null,48,{"$f":"IFERROR(TRIM(INDEX('Error Codes'!$B:$AT,MATCH($D51,'Error Codes'!$G:$G,0),MATCH($E$3,'Error Codes'!$B$2:$AT$2,0))),\"\")","v":""},{"$f":"IFERROR(TRIM(INDEX('Error Codes'!$B:$AT,MATCH($D51,'Error Codes'!$G:$G,0),MATCH(Cover!$C$14,'Error Codes'!$B$2:$AT$2,0))),\"\")","v":""},{"$f":"IFERROR(INDEX('Error Codes'!$B:$AT,MATCH($D51,'Error Codes'!$G:$G,0),MATCH($G$3,'Error Codes'!$B$2:$AT$2,0)),\"\")","v":""},{"$f":"IF(E51=\"\",\"\",CONCATENATE(E51,\"_\",Cover!$C$14))","v":""},"","","",""]
[null,"",null,49,{"$f":"IFERROR(TRIM(INDEX('Error Codes'!$B:$AT,MATCH($D52,'Error Codes'!$G:$G,0),MATCH($E$3,'Error Codes'!$B$2:$AT$2,0))),\"\")","v":""},{"$f":"IFERROR(TRIM(INDEX('Error Codes'!$B:$AT,MATCH($D52,'Error Codes'!$G:$G,0),MATCH(Cover!$C$14,'Error Codes'!$B$2:$AT$2,0))),\"\")","v":""},{"$f":"IFERROR(INDEX('Error Codes'!$B:$AT,MATCH($D52,'Error Codes'!$G:$G,0),MATCH($G$3,'Error Codes'!$B$2:$AT$2,0)),\"\")","v":""},{"$f":"IF(E52=\"\",\"\",CONCATENATE(E52,\"_\",Cover!$C$14))","v":""},"","","",""]
[null,"",null,50,{"$f":"IFERROR(TRIM(INDEX('Error Codes'!$B:$AT,MATCH($D53,'Error Codes'!$G:$G,0),MATCH($E$3,'Error Codes'!$B$2:$AT$2,0))),\"\")","v":""},{"$f":"IFERROR(TRIM(INDEX('Error Codes'!$B:$AT,MATCH($D53,'Error Codes'!$G:$G,0),MATCH(Cover!$C$14,'Error Codes'!$B$2:$AT$2,0))),\"\")","v":""},{"$f":"IFERROR(INDEX('Error Codes'!$B:$AT,MATCH($D53,'Error Codes'!$G:$G,0),MATCH($G$3,'Error Codes'!$B$2:$AT$2,0)),\"\")","v":""},{"$f":"IF(E53=\"\",\"\",CONCATENATE(E53,\"_\",Cover!$C$14))","v":""},"","","",""]
[null,"",null,51,{"$f":"IFERROR(TRIM(INDEX('Error Codes'!$B:$AT,MATCH($D54,'Error Codes'!$G:$G,0),MATCH($E$3,'Error Codes'!$B$2:$AT$2,0))),\"\")","v":""},{"$f":"IFERROR(TRIM(INDEX('Error Codes'!$B:$AT,MATCH($D54,'Error Codes'!$G:$G,0),MATCH(Cover!$C$14,'Error Codes'!$B$2:$AT$2,0))),\"\")","v":""},{"$f":"IFERROR(INDEX('Error Codes'!$B:$AT,MATCH($D54,'Error Codes'!$G:$G,0),MATCH($G$3,'Error Codes'!$B$2:$AT$2,0)),\"\")","v":""},{"$f":"IF(E54=\"\",\"\",CONCATENATE(E54,\"_\",Cover!$C$14))","v":""},"","","",""]
[null,"",null,52,{"$f":"IFERROR(TRIM(INDEX('Error Codes'!$B:$AT,MATCH($D55,'Error Codes'!$G:$G,0),MATCH($E$3,'Error Codes'!$B$2:$AT$2,0))),\"\")","v":""},{"$f":"IFERROR(TRIM(INDEX('Error Codes'!$B:$AT,MATCH($D55,'Error Codes'!$G:$G,0),MATCH(Cover!$C$14,'Error Codes'!$B$2:$AT$2,0))),\"\")","v":""},{"$f":"IFERROR(INDEX('Error Codes'!$B:$AT,MATCH($D55,'Error Codes'!$G:$G,0),MATCH($G$3,'Error Codes'!$B$2:$AT$2,0)),\"\")","v":""},{"$f":"IF(E55=\"\",\"\",CONCATENATE(E55,\"_\",Cover!$C$14))","v":""},"","","",""]
[null,"",null,53,{"$f":"IFERROR(TRIM(INDEX('Error Codes'!$B:$AT,MATCH($D56,'Error Codes'!$G:$G,0),MATCH($E$3,'Error Codes'!$B$2:$AT$2,0))),\"\")","v":""},{"$f":"IFERROR(TRIM(INDEX('Error Codes'!$B:$AT,MATCH($D56,'Error Codes'!$G:$G,0),MATCH(Cover!$C$14,'Error Codes'!$B$2:$AT$2,0))),\"\")","v":""},{"$f":"IFERROR(INDEX('Error Codes'!$B:$AT,MATCH($D56,'Error Codes'!$G:$G,0),MATCH($G$3,'Error Codes'!$B$2:$AT$2,0)),\"\")","v":""},{"$f":"IF(E56=\"\",\"\",CONCATENATE(E56,\"_\",Cover!$C$14))","v":""},"","","",""]
[null,"",null,54,{"$f":"IFERROR(TRIM(INDEX('Error Codes'!$B:$AT,MATCH($D57,'Error Codes'!$G:$G,0),MATCH($E$3,'Error Codes'!$B$2:$AT$2,0))),\"\")","v":""},{"$f":"IFERROR(TRIM(INDEX('Error Codes'!$B:$AT,MATCH($D57,'Error Codes'!$G:$G,0),MATCH(Cover!$C$14,'Error Codes'!$B$2:$AT$2,0))),\"\")","v":""},{"$f":"IFERROR(INDEX('Error Codes'!$B:$AT,MATCH($D57,'Error Codes'!$G:$G,0),MATCH($G$3,'Error Codes'!$B$2:$AT$2,0)),\"\")","v":""},{"$f":"IF(E57=\"\",\"\",CONCATENATE(E57,\"_\",Cover!$C$14))","v":""},"","","",""]
[null,"",null,55,{"$f":"IFERROR(TRIM(INDEX('Error Codes'!$B:$AT,MATCH($D58,'Error Codes'!$G:$G,0),MATCH($E$3,'Error Codes'!$B$2:$AT$2,0))),\"\")","v":""},{"$f":"IFERROR(TRIM(INDEX('Error Codes'!$B:$AT,MATCH($D58,'Error Codes'!$G:$G,0),MATCH(Cover!$C$14,'Error Codes'!$B$2:$AT$2,0))),\"\")","v":""},{"$f":"IFERROR(INDEX('Error Codes'!$B:$AT,MATCH($D58,'Error Codes'!$G:$G,0),MATCH($G$3,'Error Codes'!$B$2:$AT$2,0)),\"\")","v":""},{"$f":"IF(E58=\"\",\"\",CONCATENATE(E58,\"_\",Cover!$C$14))","v":""},"","","",""]
[null,"",null,56,{"$f":"IFERROR(TRIM(INDEX('Error Codes'!$B:$AT,MATCH($D59,'Error Codes'!$G:$G,0),MATCH($E$3,'Error Codes'!$B$2:$AT$2,0))),\"\")","v":""},{"$f":"IFERROR(TRIM(INDEX('Error Codes'!$B:$AT,MATCH($D59,'Error Codes'!$G:$G,0),MATCH(Cover!$C$14,'Error Codes'!$B$2:$AT$2,0))),\"\")","v":""},{"$f":"IFERROR(INDEX('Error Codes'!$B:$AT,MATCH($D59,'Error Codes'!$G:$G,0),MATCH($G$3,'Error Codes'!$B$2:$AT$2,0)),\"\")","v":""},{"$f":"IF(E59=\"\",\"\",CONCATENATE(E59,\"_\",Cover!$C$14))","v":""},"","","",""]
[null,"",null,57,{"$f":"IFERROR(TRIM(INDEX('Error Codes'!$B:$AT,MATCH($D60,'Error Codes'!$G:$G,0),MATCH($E$3,'Error Codes'!$B$2:$AT$2,0))),\"\")","v":""},{"$f":"IFERROR(TRIM(INDEX('Error Codes'!$B:$AT,MATCH($D60,'Error Codes'!$G:$G,0),MATCH(Cover!$C$14,'Error Codes'!$B$2:$AT$2,0))),\"\")","v":""},{"$f":"IFERROR(INDEX('Error Codes'!$B:$AT,MATCH($D60,'Error Codes'!$G:$G,0),MATCH($G$3,'Error Codes'!$B$2:$AT$2,0)),\"\")","v":""},{"$f":"IF(E60=\"\",\"\",CONCATENATE(E60,\"_\",Cover!$C$14))","v":""},"","","",""]
[null,"",null,58,{"$f":"IFERROR(TRIM(INDEX('Error Codes'!$B:$AT,MATCH($D61,'Error Codes'!$G:$G,0),MATCH($E$3,'Error Codes'!$B$2:$AT$2,0))),\"\")","v":""},{"$f":"IFERROR(TRIM(INDEX('Error Codes'!$B:$AT,MATCH($D61,'Error Codes'!$G:$G,0),MATCH(Cover!$C$14,'Error Codes'!$B$2:$AT$2,0))),\"\")","v":""},{"$f":"IFERROR(INDEX('Error Codes'!$B:$AT,MATCH($D61,'Error Codes'!$G:$G,0),MATCH($G$3,'Error Codes'!$B$2:$AT$2,0)),\"\")","v":""},{"$f":"IF(E61=\"\",\"\",CONCATENATE(E61,\"_\",Cover!$C$14))","v":""},"","","",""]
[null,"",null,59,{"$f":"IFERROR(TRIM(INDEX('Error Codes'!$B:$AT,MATCH($D62,'Error Codes'!$G:$G,0),MATCH($E$3,'Error Codes'!$B$2:$AT$2,0))),\"\")","v":""},{"$f":"IFERROR(TRIM(INDEX('Error Codes'!$B:$AT,MATCH($D62,'Error Codes'!$G:$G,0),MATCH(Cover!$C$14,'Error Codes'!$B$2:$AT$2,0))),\"\")","v":""},{"$f":"IFERROR(INDEX('Error Codes'!$B:$AT,MATCH($D62,'Error Codes'!$G:$G,0),MATCH($G$3,'Error Codes'!$B$2:$AT$2,0)),\"\")","v":""},{"$f":"IF(E62=\"\",\"\",CONCATENATE(E62,\"_\",Cover!$C$14))","v":""},"","","",""]
[null,"",null,60,{"$f":"IFERROR(TRIM(INDEX('Error Codes'!$B:$AT,MATCH($D63,'Error Codes'!$G:$G,0),MATCH($E$3,'Error Codes'!$B$2:$AT$2,0))),\"\")","v":""},{"$f":"IFERROR(TRIM(INDEX('Error Codes'!$B:$AT,MATCH($D63,'Error Codes'!$G:$G,0),MATCH(Cover!$C$14,'Error Codes'!$B$2:$AT$2,0))),\"\")","v":""},{"$f":"IFERROR(INDEX('Error Codes'!$B:$AT,MATCH($D63,'Error Codes'!$G:$G,0),MATCH($G$3,'Error Codes'!$B$2:$AT$2,0)),\"\")","v":""},{"$f":"IF(E63=\"\",\"\",CONCATENATE(E63,\"_\",Cover!$C$14))","v":""},"","","",""]
[null,"",null,61,{"$f":"IFERROR(TRIM(INDEX('Error Codes'!$B:$AT,MATCH($D64,'Error Codes'!$G:$G,0),MATCH($E$3,'Error Codes'!$B$2:$AT$2,0))),\"\")","v":""},{"$f":"IFERROR(TRIM(INDEX('Error Codes'!$B:$AT,MATCH($D64,'Error Codes'!$G:$G,0),MATCH(Cover!$C$14,'Error Codes'!$B$2:$AT$2,0))),\"\")","v":""},{"$f":"IFERROR(INDEX('Error Codes'!$B:$AT,MATCH($D64,'Error Codes'!$G:$G,0),MATCH($G$3,'Error Codes'!$B$2:$AT$2,0)),\"\")","v":""},{"$f":"IF(E64=\"\",\"\",CONCATENATE(E64,\"_\",Cover!$C$14))","v":""},"","","",""]
[null,"",null,62,{"$f":"IFERROR(TRIM(INDEX('Error Codes'!$B:$AT,MATCH($D65,'Error Codes'!$G:$G,0),MATCH($E$3,'Error Codes'!$B$2:$AT$2,0))),\"\")","v":""},{"$f":"IFERROR(TRIM(INDEX('Error Codes'!$B:$AT,MATCH($D65,'Error Codes'!$G:$G,0),MATCH(Cover!$C$14,'Error Codes'!$B$2:$AT$2,0))),\"\")","v":""},{"$f":"IFERROR(INDEX('Error Codes'!$B:$AT,MATCH($D65,'Error Codes'!$G:$G,0),MATCH($G$3,'Error Codes'!$B$2:$AT$2,0)),\"\")","v":""},{"$f":"IF(E65=\"\",\"\",CONCATENATE(E65,\"_\",Cover!$C$14))","v":""},"","","",""]
[null,"",null,63,{"$f":"IFERROR(TRIM(INDEX('Error Codes'!$B:$AT,MATCH($D66,'Error Codes'!$G:$G,0),MATCH($E$3,'Error Codes'!$B$2:$AT$2,0))),\"\")","v":""},{"$f":"IFERROR(TRIM(INDEX('Error Codes'!$B:$AT,MATCH($D66,'Error Codes'!$G:$G,0),MATCH(Cover!$C$14,'Error Codes'!$B$2:$AT$2,0))),\"\")","v":""},{"$f":"IFERROR(INDEX('Error Codes'!$B:$AT,MATCH($D66,'Error Codes'!$G:$G,0),MATCH($G$3,'Error Codes'!$B$2:$AT$2,0)),\"\")","v":""},{"$f":"IF(E66=\"\",\"\",CONCATENATE(E66,\"_\",Cover!$C$14))","v":""},"","","",""]
[null,"",null,64,{"$f":"IFERROR(TRIM(INDEX('Error Codes'!$B:$AT,MATCH($D67,'Error Codes'!$G:$G,0),MATCH($E$3,'Error Codes'!$B$2:$AT$2,0))),\"\")","v":""},{"$f":"IFERROR(TRIM(INDEX('Error Codes'!$B:$AT,MATCH($D67,'Error Codes'!$G:$G,0),MATCH(Cover!$C$14,'Error Codes'!$B$2:$AT$2,0))),\"\")","v":""},{"$f":"IFERROR(INDEX('Error Codes'!$B:$AT,MATCH($D67,'Error Codes'!$G:$G,0),MATCH($G$3,'Error Codes'!$B$2:$AT$2,0)),\"\")","v":""},{"$f":"IF(E67=\"\",\"\",CONCATENATE(E67,\"_\",Cover!$C$14))","v":""},"","","",""]
[null,"",null,65,{"$f":"IFERROR(TRIM(INDEX('Error Codes'!$B:$AT,MATCH($D68,'Error Codes'!$G:$G,0),MATCH($E$3,'Error Codes'!$B$2:$AT$2,0))),\"\")","v":""},{"$f":"IFERROR(TRIM(INDEX('Error Codes'!$B:$AT,MATCH($D68,'Error Codes'!$G:$G,0),MATCH(Cover!$C$14,'Error Codes'!$B$2:$AT$2,0))),\"\")","v":""},{"$f":"IFERROR(INDEX('Error Codes'!$B:$AT,MATCH($D68,'Error Codes'!$G:$G,0),MATCH($G$3,'Error Codes'!$B$2:$AT$2,0)),\"\")","v":""},{"$f":"IF(E68=\"\",\"\",CONCATENATE(E68,\"_\",Cover!$C$14))","v":""},"","","",""]
[null,{"$f":"IF(E69=\"\",\"\",CONCATENATE(\"replace \",H69,\" = \",I69,\" if \",L69))","v":""},null,66,{"$f":"IFERROR(TRIM(INDEX('Error Codes'!$B:$AT,MATCH($D69,'Error Codes'!$G:$G,0),MATCH($E$3,'Error Codes'!$B$2:$AT$2,0))),\"\")","v":""},{"$f":"IFERROR(TRIM(INDEX('Error Codes'!$B:$AT,MATCH($D69,'Error Codes'!$G:$G,0),MATCH(Cover!$C$14,'Error Codes'!$B$2:$AT$2,0))),\"\")","v":""},{"$f":"IFERROR(INDEX('Error Codes'!$B:$AT,MATCH($D69,'Error Codes'!$G:$G,0),MATCH($G$3,'Error Codes'!$B$2:$AT$2,0)),\"\")","v":""},{"$f":"IF(E69=\"\",\"\",CONCATENATE(E69,\"_\",Cover!$C$14))","v":""},{"$f":"IF(G69=\"\",\"\",IF(G69=\"Drop\",\".\",0))","v":""},{"$f":"IF(H69=\"\",\"\",CONCATENATE(\"inlist(\",H69,\", \",F69,\")\"))","v":""},{"$f":"IF(H69=\"\",\"\",IFERROR(VALUE(F69),\"NA\"))","v":""},{"$f":"IF(H69=\"\",\"\",IF(K69=\"NA\",J69,CONCATENATE(H69,\" == \",K69)))","v":""}]
[null,"",null,67,{"$f":"IFERROR(TRIM(INDEX('Error Codes'!$B:$AT,MATCH($D70,'Error Codes'!$G:$G,0),MATCH($E$3,'Error Codes'!$B$2:$AT$2,0))),\"\")","v":""},{"$f":"IFERROR(TRIM(INDEX('Error Codes'!$B:$AT,MATCH($D70,'Error Codes'!$G:$G,0),MATCH(Cover!$C$14,'Error Codes'!$B$2:$AT$2,0))),\"\")","v":""},{"$f":"IFERROR(INDEX('Error Codes'!$B:$AT,MATCH($D70,'Error Codes'!$G:$G,0),MATCH($G$3,'Error Codes'!$B$2:$AT$2,0)),\"\")","v":""},{"$f":"IF(E70=\"\",\"\",CONCATENATE(E70,\"_\",Cover!$C$14))","v":""},"","","",""]
[null,"",null,68,{"$f":"IFERROR(TRIM(INDEX('Error Codes'!$B:$AT,MATCH($D71,'Error Codes'!$G:$G,0),MATCH($E$3,'Error Codes'!$B$2:$AT$2,0))),\"\")","v":""},{"$f":"IFERROR(TRIM(INDEX('Error Codes'!$B:$AT,MATCH($D71,'Error Codes'!$G:$G,0),MATCH(Cover!$C$14,'Error Codes'!$B$2:$AT$2,0))),\"\")","v":""},{"$f":"IFERROR(INDEX('Error Codes'!$B:$AT,MATCH($D71,'Error Codes'!$G:$G,0),MATCH($G$3,'Error Codes'!$B$2:$AT$2,0)),\"\")","v":""},{"$f":"IF(E71=\"\",\"\",CONCATENATE(E71,\"_\",Cover!$C$14))","v":""},"","","",""]
[null,"",null,69,{"$f":"IFERROR(TRIM(INDEX('Error Codes'!$B:$AT,MATCH($D72,'Error Codes'!$G:$G,0),MATCH($E$3,'Error Codes'!$B$2:$AT$2,0))),\"\")","v":""},{"$f":"IFERROR(TRIM(INDEX('Error Codes'!$B:$AT,MATCH($D72,'Error Codes'!$G:$G,0),MATCH(Cover!$C$14,'Error Codes'!$B$2:$AT$2,0))),\"\")","v":""},{"$f":"IFERROR(INDEX('Error Codes'!$B:$AT,MATCH($D72,'Error Codes'!$G:$G,0),MATCH($G$3,'Error Codes'!$B$2:$AT$2,0)),\"\")","v":""},{"$f":"IF(E72=\"\",\"\",CONCATENATE(E72,\"_\",Cover!$C$14))","v":""},"","","",""]
[null,"",null,70,{"$f":"IFERROR(TRIM(INDEX('Error Codes'!$B:$AT,MATCH($D73,'Error Codes'!$G:$G,0),MATCH($E$3,'Error Codes'!$B$2:$AT$2,0))),\"\")","v":""},{"$f":"IFERROR(TRIM(INDEX('Error Codes'!$B:$AT,MATCH($D73,'Error Codes'!$G:$G,0),MATCH(Cover!$C$14,'Error Codes'!$B$2:$AT$2,0))),\"\")","v":""},{"$f":"IFERROR(INDEX('Error Codes'!$B:$AT,MATCH($D73,'Error Codes'!$G:$G,0),MATCH($G$3,'Error Codes'!$B$2:$AT$2,0)),\"\")","v":""},{"$f":"IF(E73=\"\",\"\",CONCATENATE(E73,\"_\",Cover!$C$14))","v":""},"","","",""]
[null,"",null,71,{"$f":"IFERROR(TRIM(INDEX('Error Codes'!$B:$AT,MATCH($D74,'Error Codes'!$G:$G,0),MATCH($E$3,'Error Codes'!$B$2:$AT$2,0))),\"\")","v":""},{"$f":"IFERROR(TRIM(INDEX('Error Codes'!$B:$AT,MATCH($D74,'Error Codes'!$G:$G,0),MATCH(Cover!$C$14,'Error Codes'!$B$2:$AT$2,0))),\"\")","v":""},{"$f":"IFERROR(INDEX('Error Codes'!$B:$AT,MATCH($D74,'Error Codes'!$G:$G,0),MATCH($G$3,'Error Codes'!$B$2:$AT$2,0)),\"\")","v":""},{"$f":"IF(E74=\"\",\"\",CONCATENATE(E74,\"_\",Cover!$C$14))","v":""},"","","",""]
[null,"",null,72,{"$f":"IFERROR(TRIM(INDEX('Error Codes'!$B:$AT,MATCH($D75,'Error Codes'!$G:$G,0),MATCH($E$3,'Error Codes'!$B$2:$AT$2,0))),\"\")","v":""},{"$f":"IFERROR(TRIM(INDEX('Error Codes'!$B:$AT,MATCH($D75,'Error Codes'!$G:$G,0),MATCH(Cover!$C$14,'Error Codes'!$B$2:$AT$2,0))),\"\")","v":""},{"$f":"IFERROR(INDEX('Error Codes'!$B:$AT,MATCH($D75,'Error Codes'!$G:$G,0),MATCH($G$3,'Error Codes'!$B$2:$AT$2,0)),\"\")","v":""},{"$f":"IF(E75=\"\",\"\",CONCATENATE(E75,\"_\",Cover!$C$14))","v":""},"","","",""]
[null,"",null,73,{"$f":"IFERROR(TRIM(INDEX('Error Codes'!$B:$AT,MATCH($D76,'Error Codes'!$G:$G,0),MATCH($E$3,'Error Codes'!$B$2:$AT$2,0))),\"\")","v":""},{"$f":"IFERROR(TRIM(INDEX('Error Codes'!$B:$AT,MATCH($D76,'Error Codes'!$G:$G,0),MATCH(Cover!$C$14,'Error Codes'!$B$2:$AT$2,0))),\"\")","v":""},{"$f":"IFERROR(INDEX('Error Codes'!$B:$AT,MATCH($D76,'Error Codes'!$G:$G,0),MATCH($G$3,'Error Codes'!$B$2:$AT$2,0)),\"\")","v":""},{"$f":"IF(E76=\"\",\"\",CONCATENATE(E76,\"_\",Cover!$C$14))","v":""},"","","",""]
[null,"",null,74,{"$f":"IFERROR(TRIM(INDEX('Error Codes'!$B:$AT,MATCH($D77,'Error Codes'!$G:$G,0),MATCH($E$3,'Error Codes'!$B$2:$AT$2,0))),\"\")","v":""},{"$f":"IFERROR(TRIM(INDEX('Error Codes'!$B:$AT,MATCH($D77,'Error Codes'!$G:$G,0),MATCH(Cover!$C$14,'Error Codes'!$B$2:$AT$2,0))),\"\")","v":""},{"$f":"IFERROR(INDEX('Error Codes'!$B:$AT,MATCH($D77,'Error Codes'!$G:$G,0),MATCH($G$3,'Error Codes'!$B$2:$AT$2,0)),\"\")","v":""},{"$f":"IF(E77=\"\",\"\",CONCATENATE(E77,\"_\",Cover!$C$14))","v":""},"","","",""]
[null,"",null,75,{"$f":"IFERROR(TRIM(INDEX('Error Codes'!$B:$AT,MATCH($D78,'Error Codes'!$G:$G,0),MATCH($E$3,'Error Codes'!$B$2:$AT$2,0))),\"\")","v":""},{"$f":"IFERROR(TRIM(INDEX('Error Codes'!$B:$AT,MATCH($D78,'Error Codes'!$G:$G,0),MATCH(Cover!$C$14,'Error Codes'!$B$2:$AT$2,0))),\"\")","v":""},{"$f":"IFERROR(INDEX('Error Codes'!$B:$AT,MATCH($D78,'Error Codes'!$G:$G,0),MATCH($G$3,'Error Codes'!$B$2:$AT$2,0)),\"\")","v":""},{"$f":"IF(E78=\"\",\"\",CONCATENATE(E78,\"_\",Cover!$C$14))","v":""},"","","",""]
[null,"",null,76,{"$f":"IFERROR(TRIM(INDEX('Error Codes'!$B:$AT,MATCH($D79,'Error Codes'!$G:$G,0),MATCH($E$3,'Error Codes'!$B$2:$AT$2,0))),\"\")","v":""},{"$f":"IFERROR(TRIM(INDEX('Error Codes'!$B:$AT,MATCH($D79,'Error Codes'!$G:$G,0),MATCH(Cover!$C$14,'Error Codes'!$B$2:$AT$2,0))),\"\")","v":""},{"$f":"IFERROR(INDEX('Error Codes'!$B:$AT,MATCH($D79,'Error Codes'!$G:$G,0),MATCH($G$3,'Error Codes'!$B$2:$AT$2,0)),\"\")","v":""},{"$f":"IF(E79=\"\",\"\",CONCATENATE(E79,\"_\",Cover!$C$14))","v":""},"","","",""]
[null,"",null,77,{"$f":"IFERROR(TRIM(INDEX('Error Codes'!$B:$AT,MATCH($D80,'Error Codes'!$G:$G,0),MATCH($E$3,'Error Codes'!$B$2:$AT$2,0))),\"\")","v":""},{"$f":"IFERROR(TRIM(INDEX('Error Codes'!$B:$AT,MATCH($D80,'Error Codes'!$G:$G,0),MATCH(Cover!$C$14,'Error Codes'!$B$2:$AT$2,0))),\"\")","v":""},{"$f":"IFERROR(INDEX('Error Codes'!$B:$AT,MATCH($D80,'Error Codes'!$G:$G,0),MATCH($G$3,'Error Codes'!$B$2:$AT$2,0)),\"\")","v":""},{"$f":"IF(E80=\"\",\"\",CONCATENATE(E80,\"_\",Cover!$C$14))","v":""},"","","",""]
[null,"",null,78,{"$f":"IFERROR(TRIM(INDEX('Error Codes'!$B:$AT,MATCH($D81,'Error Codes'!$G:$G,0),MATCH($E$3,'Error Codes'!$B$2:$AT$2,0))),\"\")","v":""},{"$f":"IFERROR(TRIM(INDEX('Error Codes'!$B:$AT,MATCH($D81,'Error Codes'!$G:$G,0),MATCH(Cover!$C$14,'Error Codes'!$B$2:$AT$2,0))),\"\")","v":""},{"$f":"IFERROR(INDEX('Error Codes'!$B:$AT,MATCH($D81,'Error Codes'!$G:$G,0),MATCH($G$3,'Error Codes'!$B$2:$AT$2,0)),\"\")","v":""},{"$f":"IF(E81=\"\",\"\",CONCATENATE(E81,\"_\",Cover!$C$14))","v":""},"","","",""]
[null,"",null,79,{"$f":"IFERROR(TRIM(INDEX('Error Codes'!$B:$AT,MATCH($D82,'Error Codes'!$G:$G,0),MATCH($E$3,'Error Codes'!$B$2:$AT$2,0))),\"\")","v":""},{"$f":"IFERROR(TRIM(INDEX('Error Codes'!$B:$AT,MATCH($D82,'Error Codes'!$G:$G,0),MATCH(Cover!$C$14,'Error Codes'!$B$2:$AT$2,0))),\"\")","v":""},{"$f":"IFERROR(INDEX('Error Codes'!$B:$AT,MATCH($D82,'Error Codes'!$G:$G,0),MATCH($G$3,'Error Codes'!$B$2:$AT$2,0)),\"\")","v":""},{"$f":"IF(E82=\"\",\"\",CONCATENATE(E82,\"_\",Cover!$C$14))","v":""},"","","",""]
[null,"",null,80,{"$f":"IFERROR(TRIM(INDEX('Error Codes'!$B:$AT,MATCH($D83,'Error Codes'!$G:$G,0),MATCH($E$3,'Error Codes'!$B$2:$AT$2,0))),\"\")","v":""},{"$f":"IFERROR(TRIM(INDEX('Error Codes'!$B:$AT,MATCH($D83,'Error Codes'!$G:$G,0),MATCH(Cover!$C$14,'Error Codes'!$B$2:$AT$2,0))),\"\")","v":""},{"$f":"IFERROR(INDEX('Error Codes'!$B:$AT,MATCH($D83,'Error Codes'!$G:$G,0),MATCH($G$3,'Error Codes'!$B$2:$AT$2,0)),\"\")","v":""},{"$f":"IF(E83=\"\",\"\",CONCATENATE(E83,\"_\",Cover!$C$14))","v":""},"","","",""]
[null,"",null,81,{"$f":"IFERROR(TRIM(INDEX('Error Codes'!$B:$AT,MATCH($D84,'Error Codes'!$G:$G,0),MATCH($E$3,'Error Codes'!$B$2:$AT$2,0))),\"\")","v":""},{"$f":"IFERROR(TRIM(INDEX('Error Codes'!$B:$AT,MATCH($D84,'Error Codes'!$G:$G,0),MATCH(Cover!$C$14,'Error Codes'!$B$2:$AT$2,0))),\"\")","v":""},{"$f":"IFERROR(INDEX('Error Codes'!$B:$AT,MATCH($D84,'Error Codes'!$G:$G,0),MATCH($G$3,'Error Codes'!$B$2:$AT$2,0)),\"\")","v":""},{"$f":"IF(E84=\"\",\"\",CONCATENATE(E84,\"_\",Cover!$C$14))","v":""},"","","",""]
[null,"",null,82,{"$f":"IFERROR(TRIM(INDEX('Error Codes'!$B:$AT,MATCH($D85,'Error Codes'!$G:$G,0),MATCH($E$3,'Error Codes'!$B$2:$AT$2,0))),\"\")","v":""},{"$f":"IFERROR(TRIM(INDEX('Error Codes'!$B:$AT,MATCH($D85,'Error Codes'!$G:$G,0),MATCH(Cover!$C$14,'Error Codes'!$B$2:$AT$2,0))),\"\")","v":""},{"$f":"IFERROR(INDEX('Error Codes'!$B:$AT,MATCH($D85,'Error Codes'!$G:$G,0),MATCH($G$3,'Error Codes'!$B$2:$AT$2,0)),\"\")","v":""},{"$f":"IF(E85=\"\",\"\",CONCATENATE(E85,\"_\",Cover!$C$14))","v":""},"","","",""]
[null,"",null,83,{"$f":"IFERROR(TRIM(INDEX('Error Codes'!$B:$AT,MATCH($D86,'Error Codes'!$G:$G,0),MATCH($E$3,'Error Codes'!$B$2:$AT$2,0))),\"\")","v":""},{"$f":"IFERROR(TRIM(INDEX('Error Codes'!$B:$AT,MATCH($D86,'Error Codes'!$G:$G,0),MATCH(Cover!$C$14,'Error Codes'!$B$2:$AT$2,0))),\"\")","v":""},{"$f":"IFERROR(INDEX('Error Codes'!$B:$AT,MATCH($D86,'Error Codes'!$G:$G,0),MATCH($G$3,'Error Codes'!$B$2:$AT$2,0)),\"\")","v":""},{"$f":"IF(E86=\"\",\"\",CONCATENATE(E86,\"_\",Cover!$C$14))","v":""},"","","",""]
[null,"",null,84,{"$f":"IFERROR(TRIM(INDEX('Error Codes'!$B:$AT,MATCH($D87,'Error Codes'!$G:$G,0),MATCH($E$3,'Error Codes'!$B$2:$AT$2,0))),\"\")","v":""},{"$f":"IFERROR(TRIM(INDEX('Error Codes'!$B:$AT,MATCH($D87,'Error Codes'!$G:$G,0),MATCH(Cover!$C$14,'Error Codes'!$B$2:$AT$2,0))),\"\")","v":""},{"$f":"IFERROR(INDEX('Error Codes'!$B:$AT,MATCH($D87,'Error Codes'!$G:$G,0),MATCH($G$3,'Error Codes'!$B$2:$AT$2,0)),\"\")","v":""},{"$f":"IF(E87=\"\",\"\",CONCATENATE(E87,\"_\",Cover!$C$14))","v":""},"","","",""]
[null,"",null,85,{"$f":"IFERROR(TRIM(INDEX('Error Codes'!$B:$AT,MATCH($D88,'Error Codes'!$G:$G,0),MATCH($E$3,'Error Codes'!$B$2:$AT$2,0))),\"\")","v":""},{"$f":"IFERROR(TRIM(INDEX('Error Codes'!$B:$AT,MATCH($D88,'Error Codes'!$G:$G,0),MATCH(Cover!$C$14,'Error Codes'!$B$2:$AT$2,0))),\"\")","v":""},{"$f":"IFERROR(INDEX('Error Codes'!$B:$AT,MATCH($D88,'Error Codes'!$G:$G,0),MATCH($G$3,'Error Codes'!$B$2:$AT$2,0)),\"\")","v":""},{"$f":"IF(E88=\"\",\"\",CONCATENATE(E88,\"_\",Cover!$C$14))","v":""},"","","",""]
[null,"",null,86,{"$f":"IFERROR(TRIM(INDEX('Error Codes'!$B:$AT,MATCH($D89,'Error Codes'!$G:$G,0),MATCH($E$3,'Error Codes'!$B$2:$AT$2,0))),\"\")","v":""},{"$f":"IFERROR(TRIM(INDEX('Error Codes'!$B:$AT,MATCH($D89,'Error Codes'!$G:$G,0),MATCH(Cover!$C$14,'Error Codes'!$B$2:$AT$2,0))),\"\")","v":""},{"$f":"IFERROR(INDEX('Error Codes'!$B:$AT,MATCH($D89,'Error Codes'!$G:$G,0),MATCH($G$3,'Error Codes'!$B$2:$AT$2,0)),\"\")","v":""},{"$f":"IF(E89=\"\",\"\",CONCATENATE(E89,\"_\",Cover!$C$14))","v":""},"","","",""]
[null,"",null,87,{"$f":"IFERROR(TRIM(INDEX('Error Codes'!$B:$AT,MATCH($D90,'Error Codes'!$G:$G,0),MATCH($E$3,'Error Codes'!$B$2:$AT$2,0))),\"\")","v":""},{"$f":"IFERROR(TRIM(INDEX('Error Codes'!$B:$AT,MATCH($D90,'Error Codes'!$G:$G,0),MATCH(Cover!$C$14,'Error Codes'!$B$2:$AT$2,0))),\"\")","v":""},{"$f":"IFERROR(INDEX('Error Codes'!$B:$AT,MATCH($D90,'Error Codes'!$G:$G,0),MATCH($G$3,'Error Codes'!$B$2:$AT$2,0)),\"\")","v":""},{"$f":"IF(E90=\"\",\"\",CONCATENATE(E90,\"_\",Cover!$C$14))","v":""},"","","",""]
[null,"",null,88,{"$f":"IFERROR(TRIM(INDEX('Error Codes'!$B:$AT,MATCH($D91,'Error Codes'!$G:$G,0),MATCH($E$3,'Error Codes'!$B$2:$AT$2,0))),\"\")","v":""},{"$f":"IFERROR(TRIM(INDEX('Error Codes'!$B:$AT,MATCH($D91,'Error Codes'!$G:$G,0),MATCH(Cover!$C$14,'Error Codes'!$B$2:$AT$2,0))),\"\")","v":""},{"$f":"IFERROR(INDEX('Error Codes'!$B:$AT,MATCH($D91,'Error Codes'!$G:$G,0),MATCH($G$3,'Error Codes'!$B$2:$AT$2,0)),\"\")","v":""},{"$f":"IF(E91=\"\",\"\",CONCATENATE(E91,\"_\",Cover!$C$14))","v":""},"","","",""]
[null,"",null,89,{"$f":"IFERROR(TRIM(INDEX('Error Codes'!$B:$AT,MATCH($D92,'Error Codes'!$G:$G,0),MATCH($E$3,'Error Codes'!$B$2:$AT$2,0))),\"\")","v":""},{"$f":"IFERROR(TRIM(INDEX('Error Codes'!$B:$AT,MATCH($D92,'Error Codes'!$G:$G,0),MATCH(Cover!$C$14,'Error Codes'!$B$2:$AT$2,0))),\"\")","v":""},{"$f":"IFERROR(INDEX('Error Codes'!$B:$AT,MATCH($D92,'Error Codes'!$G:$G,0),MATCH($G$3,'Error Codes'!$B$2:$AT$2,0)),\"\")","v":""},{"$f":"IF(E92=\"\",\"\",CONCATENATE(E92,\"_\",Cover!$C$14))","v":""},"","","",""]
[null,"",null,90,{"$f":"IFERROR(TRIM(INDEX('Error Codes'!$B:$AT,MATCH($D93,'Error Codes'!$G:$G,0),MATCH($E$3,'Error Codes'!$B$2:$AT$2,0))),\"\")","v":""},{"$f":"IFERROR(TRIM(INDEX('Error Codes'!$B:$AT,MATCH($D93,'Error Codes'!$G:$G,0),MATCH(Cover!$C$14,'Error Codes'!$B$2:$AT$2,0))),\"\")","v":""},{"$f":"IFERROR(INDEX('Error Codes'!$B:$AT,MATCH($D93,'Error Codes'!$G:$G,0),MATCH($G$3,'Error Codes'!$B$2:$AT$2,0)),\"\")","v":""},{"$f":"IF(E93=\"\",\"\",CONCATENATE(E93,\"_\",Cover!$C$14))","v":""},"","","",""]
[null,"",null,91,{"$f":"IFERROR(TRIM(INDEX('Error Codes'!$B:$AT,MATCH($D94,'Error Codes'!$G:$G,0),MATCH($E$3,'Error Codes'!$B$2:$AT$2,0))),\"\")","v":""},{"$f":"IFERROR(TRIM(INDEX('Error Codes'!$B:$AT,MATCH($D94,'Error Codes'!$G:$G,0),MATCH(Cover!$C$14,'Error Codes'!$B$2:$AT$2,0))),\"\")","v":""},{"$f":"IFERROR(INDEX('Error Codes'!$B:$AT,MATCH($D94,'Error Codes'!$G:$G,0),MATCH($G$3,'Error Codes'!$B$2:$AT$2,0)),\"\")","v":""},{"$f":"IF(E94=\"\",\"\",CONCATENATE(E94,\"_\",Cover!$C$14))","v":""},"","","",""]
[null,"",null,92,{"$f":"IFERROR(TRIM(INDEX('Error Codes'!$B:$AT,MATCH($D95,'Error Codes'!$G:$G,0),MATCH($E$3,'Error Codes'!$B$2:$AT$2,0))),\"\")","v":""},{"$f":"IFERROR(TRIM(INDEX('Error Codes'!$B:$AT,MATCH($D95,'Error Codes'!$G:$G,0),MATCH(Cover!$C$14,'Error Codes'!$B$2:$AT$2,0))),\"\")","v":""},{"$f":"IFERROR(INDEX('Error Codes'!$B:$AT,MATCH($D95,'Error Codes'!$G:$G,0),MATCH($G$3,'Error Codes'!$B$2:$AT$2,0)),\"\")","v":""},{"$f":"IF(E95=\"\",\"\",CONCATENATE(E95,\"_\",Cover!$C$14))","v":""},"","","",""]
[null,"",null,93,{"$f":"IFERROR(TRIM(INDEX('Error Codes'!$B:$AT,MATCH($D96,'Error Codes'!$G:$G,0),MATCH($E$3,'Error Codes'!$B$2:$AT$2,0))),\"\")","v":""},{"$f":"IFERROR(TRIM(INDEX('Error Codes'!$B:$AT,MATCH($D96,'Error Codes'!$G:$G,0),MATCH(Cover!$C$14,'Error Codes'!$B$2:$AT$2,0))),\"\")","v":""},{"$f":"IFERROR(INDEX('Error Codes'!$B:$AT,MATCH($D96,'Error Codes'!$G:$G,0),MATCH($G$3,'Error Codes'!$B$2:$AT$2,0)),\"\")","v":""},{"$f":"IF(E96=\"\",\"\",CONCATENATE(E96,\"_\",Cover!$C$14))","v":""},"","","",""]
[null,"",null,94,{"$f":"IFERROR(TRIM(INDEX('Error Codes'!$B:$AT,MATCH($D97,'Error Codes'!$G:$G,0),MATCH($E$3,'Error Codes'!$B$2:$AT$2,0))),\"\")","v":""},{"$f":"IFERROR(TRIM(INDEX('Error Codes'!$B:$AT,MATCH($D97,'Error Codes'!$G:$G,0),MATCH(Cover!$C$14,'Error Codes'!$B$2:$AT$2,0))),\"\")","v":""},{"$f":"IFERROR(INDEX('Error Codes'!$B:$AT,MATCH($D97,'Error Codes'!$G:$G,0),MATCH($G$3,'Error Codes'!$B$2:$AT$2,0)),\"\")","v":""},{"$f":"IF(E97=\"\",\"\",CONCATENATE(E97,\"_\",Cover!$C$14))","v":""},"","","",""]
[null,"",null,95,{"$f":"IFERROR(TRIM(INDEX('Error Codes'!$B:$AT,MATCH($D98,'Error Codes'!$G:$G,0),MATCH($E$3,'Error Codes'!$B$2:$AT$2,0))),\"\")","v":""},{"$f":"IFERROR(TRIM(INDEX('Error Codes'!$B:$AT,MATCH($D98,'Error Codes'!$G:$G,0),MATCH(Cover!$C$14,'Error Codes'!$B$2:$AT$2,0))),\"\")","v":""},{"$f":"IFERROR(INDEX('Error Codes'!$B:$AT,MATCH($D98,'Error Codes'!$G:$G,0),MATCH($G$3,'Error Codes'!$B$2:$AT$2,0)),\"\")","v":""},{"$f":"IF(E98=\"\",\"\",CONCATENATE(E98,\"_\",Cover!$C$14))","v":""},"","","",""]
[null,"",null,96,{"$f":"IFERROR(TRIM(INDEX('Error Codes'!$B:$AT,MATCH($D99,'Error Codes'!$G:$G,0),MATCH($E$3,'Error Codes'!$B$2:$AT$2,0))),\"\")","v":""},{"$f":"IFERROR(TRIM(INDEX('Error Codes'!$B:$AT,MATCH($D99,'Error Codes'!$G:$G,0),MATCH(Cover!$C$14,'Error Codes'!$B$2:$AT$2,0))),\"\")","v":""},{"$f":"IFERROR(INDEX('Error Codes'!$B:$AT,MATCH($D99,'Error Codes'!$G:$G,0),MATCH($G$3,'Error Codes'!$B$2:$AT$2,0)),\"\")","v":""},{"$f":"IF(E99=\"\",\"\",CONCATENATE(E99,\"_\",Cover!$C$14))","v":""},"","","",""]
[null,"",null,97,{"$f":"IFERROR(TRIM(INDEX('Error Codes'!$B:$AT,MATCH($D100,'Error Codes'!$G:$G,0),MATCH($E$3,'Error Codes'!$B$2:$AT$2,0))),\"\")","v":""},{"$f":"IFERROR(TRIM(INDEX('Error Codes'!$B:$AT,MATCH($D100,'Error Codes'!$G:$G,0),MATCH(Cover!$C$14,'Error Codes'!$B$2:$AT$2,0))),\"\")","v":""},{"$f":"IFERROR(INDEX('Error Codes'!$B:$AT,MATCH($D100,'Error Codes'!$G:$G,0),MATCH($G$3,'Error Codes'!$B$2:$AT$2,0)),\"\")","v":""},{"$f":"IF(E100=\"\",\"\",CONCATENATE(E100,\"_\",Cover!$C$14))","v":""},"","","",""]
[null,"",null,98,{"$f":"IFERROR(TRIM(INDEX('Error Codes'!$B:$AT,MATCH($D101,'Error Codes'!$G:$G,0),MATCH($E$3,'Error Codes'!$B$2:$AT$2,0))),\"\")","v":""},{"$f":"IFERROR(TRIM(INDEX('Error Codes'!$B:$AT,MATCH($D101,'Error Codes'!$G:$G,0),MATCH(Cover!$C$14,'Error Codes'!$B$2:$AT$2,0))),\"\")","v":""},{"$f":"IFERROR(INDEX('Error Codes'!$B:$AT,MATCH($D101,'Error Codes'!$G:$G,0),MATCH($G$3,'Error Codes'!$B$2:$AT$2,0)),\"\")","v":""},{"$f":"IF(E101=\"\",\"\",CONCATENATE(E101,\"_\",Cover!$C$14))","v":""},"","","",""]
[null,"",null,99,{"$f":"IFERROR(TRIM(INDEX('Error Codes'!$B:$AT,MATCH($D102,'Error Codes'!$G:$G,0),MATCH($E$3,'Error Codes'!$B$2:$AT$2,0))),\"\")","v":""},{"$f":"IFERROR(TRIM(INDEX('Error Codes'!$B:$AT,MATCH($D102,'Error Codes'!$G:$G,0),MATCH(Cover!$C$14,'Error Codes'!$B$2:$AT$2,0))),\"\")","v":""},{"$f":"IFERROR(INDEX('Error Codes'!$B:$AT,MATCH($D102,'Error Codes'!$G:$G,0),MATCH($G$3,'Error Codes'!$B$2:$AT$2,0)),\"\")","v":""},{"$f":"IF(E102=\"\",\"\",CONCATENATE(E102,\"_\",Cover!$C$14))","v":""},"","","",""]
[null,"",null,100,{"$f":"IFERROR(TRIM(INDEX('Error Codes'!$B:$AT,MATCH($D103,'Error Codes'!$G:$G,0),MATCH($E$3,'Error Codes'!$B$2:$AT$2,0))),\"\")","v":""},{"$f":"IFERROR(TRIM(INDEX('Error Codes'!$B:$AT,MATCH($D103,'Error Codes'!$G:$G,0),MATCH(Cover!$C$14,'Error Codes'!$B$2:$AT$2,0))),\"\")","v":""},{"$f":"IFERROR(INDEX('Error Codes'!$B:$AT,MATCH($D103,'Error Codes'!$G:$G,0),MATCH($G$3,'Error Codes'!$B$2:$AT$2,0)),\"\")","v":""},{"$f":"IF(E103=\"\",\"\",CONCATENATE(E103,\"_\",Cover!$C$14))","v":""},"","","",""]

{"sheet":"Annualize","index":5,"n_rows":73,"n_cols":25,"rows_kept":73,"cut":false,"hidden":false,"merged":[[1,11,1,24]]}
[]
[null,"List of All Time Unit Variables",null,null,null,null,"Annualize (Stata Code)",null,null,"Set Multipliers (Stata Code)",null,"Input Calculations"]
[null,"PSID Name","Variable Name","Included?","This Year?",null,"*** Annualize Values",null,null,"*** Replace Time Unit Indicators with Multiplier Values",null,"Var #","Unit","PSID Name","Variable Name","Replace With","Matching Name","Available?","Condition","Numeric","Cond. Code if List","Multiplier Code","Variable Applies To","Annualization Code","Count"]
[null,"CHILD CARE COST PER",{"$f":"IF(B4=\"\",\"\",OFFSET(Variables!$E$2,MATCH(B4,Variables!$H$3:$H$45,0),0))","v":"childcare1_TU"},{"$f":"IFERROR(INDEX(Variables!$B$2:$AT$45,MATCH($B4,Variables!$H$2:$H$45,0),MATCH(\"Included?\",Variables!$B$2:$AT$2,0)),\"\")","v":"Y"},{"$f":"IFERROR(IF(INDEX(Variables!$1:$1048576,MATCH(B4,Variables!$H:$H,0),MATCH(Cover!$C$14,Variables!$2:$2,0))=\"-\",\"N\",\"Y\"),\"\")","v":"N"},null,{"$f":"IF(C4=\"\",\"\",IF(AND(D4=\"Y\",E4=\"Y\"),OFFSET($X$3,MATCH(C4,$O$4:$O$73,0),0),CONCATENATE(\"* Variable \",C4,\" not included in data set\")))","v":"* Variable childcare1_TU not included in data set"},null,1,{"$f":"IFERROR(OFFSET($V$3,MATCH(I4,$Y$4:$Y$45,0),0),\"\")","v":""},null,1,"Hour",{"$f":"IF(OFFSET($B$3,L4,0)=\"\",\"\",OFFSET($B$3,L4,0))","v":"CHILD CARE COST PER"},{"$f":"IF(N4=\"\",\"\",OFFSET(Variables!$E$2,MATCH(N4,Variables!$H$3:$H$45,0),0))","v":"childcare1_TU"},{"$f":"IF(N4=\"\",\"\",HLOOKUP(M4,'Time Units'!$E$2:$K$3,2,0))","v":"."},{"$f":"IF(N4=\"\",\"\",IF(Cover!$C$14>1996,'Time Units'!$D$4,CONCATENATE(O4,\"_\",Cover!$C$14)))","v":"childcare1_TU_1968"},{"$f":"IF(N4=\"\",\"\",AND(OFFSET($D$3,MATCH(N4,$B$4:$B$13,0),0)=\"Y\",OFFSET($E$3,MATCH(N4,$B$4:$B$13,0),0)=\"Y\"))","v":false},{"$f":"IF(N4=\"\",\"\",IF(R4,INDEX('Time Units'!$B:$K,MATCH(Q4,'Time Units'!$D:$D,0),MATCH(M4,'Time Units'!$B$2:$K$2,0)),0))","v":0},{"$f":"IF(S4=\"\",\"\",IFERROR(VALUE(S4),\"NA\"))","v":0},{"$f":"IF(T4=\"\",\"\",IF(T4=\"NA\",CONCATENATE(\"inlist(\",Q4,\", \",S4,\")\"),CONCATENATE(O4,\" == \",T4)))","v":"childcare1_TU == 0"},{"$f":"IF(N4=\"\",\"\",CONCATENATE(\"replace \",O4,\"_\",Cover!$C$14,\" = \",P4,\" if \",U4))","v":"replace childcare1_TU_1968 = . if childcare1_TU == 0"},{"$f":"IF(N4=\"\",\"\",CONCATENATE(LEFT(O4,LEN(O4)-3),\"_\",Cover!$C$14))","v":"childcare1_1968"},{"$f":"IF(N4=\"\",\"\",CONCATENATE(\"replace \",W4,\" = \",W4))","v":"replace childcare1_1968 = childcare1_1968"},{"$f":"IF(N4=\"\",\"\",IF(S4>0,IF(ISNUMBER(Y3),Y3+1,1),IF(ISNUMBER(Y3),Y3,0)))","v":0}]
[null,"TIME UNIT-WF RPRTD PENSION/ANNUITY",{"$f":"IF(B5=\"\",\"\",OFFSET(Variables!$E$2,MATCH(B5,Variables!$H$3:$H$45,0),0))","v":"pension_inc6_TU"},{"$f":"IFERROR(INDEX(Variables!$B$2:$AT$45,MATCH($B5,Variables!$H$2:$H$45,0),MATCH(\"Included?\",Variables!$B$2:$AT$2,0)),\"\")","v":"Y"},{"$f":"IFERROR(IF(INDEX(Variables!$1:$1048576,MATCH(B5,Variables!$H:$H,0),MATCH(Cover!$C$14,Variables!$2:$2,0))=\"-\",\"N\",\"Y\"),\"\")","v":"N"},null,{"$f":"IF(C5=\"\",\"\",IF(AND(D5=\"Y\",E5=\"Y\"),OFFSET($X$3,MATCH(C5,$O$4:$O$73,0),0),CONCATENATE(\"* Variable \",C5,\" not included in data set\")))","v":"* Variable pension_inc6_TU not included in data set"},null,2,{"$f":"IFERROR(OFFSET($V$3,MATCH(I5,$Y$4:$Y$45,0),0),\"\")","v":""},null,1,"Day",{"$f":"IF(OFFSET($B$3,L5,0)=\"\",\"\",OFFSET($B$3,L5,0))","v":"CHILD CARE COST PER"},{"$f":"IF(N5=\"\",\"\",OFFSET(Variables!$E$2,MATCH(N5,Variables!$H$3:$H$45,0),0))","v":"childcare1_TU"},{"$f":"IF(N5=\"\",\"\",HLOOKUP(M5,'Time Units'!$E$2:$K$3,2,0))","v":"."},{"$f":"IF(N5=\"\",\"\",IF(Cover!$C$14>1996,'Time Units'!$D$4,CONCATENATE(O5,\"_\",Cover!$C$14)))","v":"childcare1_TU_1968"},{"$f":"IF(N5=\"\",\"\",AND(OFFSET($D$3,MATCH(N5,$B$4:$B$13,0),0)=\"Y\",OFFSET($E$3,MATCH(N5,$B$4:$B$13,0),0)=\"Y\"))","v":false},{"$f":"IF(N5=\"\",\"\",IF(R5,INDEX('Time Units'!$B:$K,MATCH(Q5,'Time Units'!$D:$D,0),MATCH(M5,'Time Units'!$B$2:$K$2,0)),0))","v":0},{"$f":"IF(S5=\"\",\"\",IFERROR(VALUE(S5),\"NA\"))","v":0},{"$f":"IF(T5=\"\",\"\",IF(T5=\"NA\",CONCATENATE(\"inlist(\",Q5,\", \",S5,\")\"),CONCATENATE(O5,\" == \",T5)))","v":"childcare1_TU == 0"},{"$f":"IF(N5=\"\",\"\",CONCATENATE(\"replace \",O5,\"_\",Cover!$C$14,\" = \",P5,\" if \",U5))","v":"replace childcare1_TU_1968 = . if childcare1_TU == 0"},{"$f":"IF(N5=\"\",\"\",CONCATENATE(LEFT(O5,LEN(O5)-3),\"_\",Cover!$C$14))","v":"childcare1_1968"},{"$f":"IF(N5=\"\",\"\",CONCATENATE(\"replace \",W5,\" = \",W5))","v":"replace childcare1_1968 = childcare1_1968"},0]
[null,"TIME UNIT-HD RPRTD ANNUITIES/IRAS",{"$f":"IF(B6=\"\",\"\",OFFSET(Variables!$E$2,MATCH(B6,Variables!$H$3:$H$45,0),0))","v":"pension_inc8_TU"},{"$f":"IFERROR(INDEX(Variables!$B$2:$AT$45,MATCH($B6,Variables!$H$2:$H$45,0),MATCH(\"Included?\",Variables!$B$2:$AT$2,0)),\"\")","v":"Y"},{"$f":"IFERROR(IF(INDEX(Variables!$1:$1048576,MATCH(B6,Variables!$H:$H,0),MATCH(Cover!$C$14,Variables!$2:$2,0))=\"-\",\"N\",\"Y\"),\"\")","v":"N"},null,"* Variable pension_inc8_TU not included in data set",null,3,"",null,1,"Week","CHILD CARE COST PER",{"$f":"IF(N6=\"\",\"\",OFFSET(Variables!$E$2,MATCH(N6,Variables!$H$3:$H$45,0),0))","v":"childcare1_TU"},{"$f":"IF(N6=\"\",\"\",HLOOKUP(M6,'Time Units'!$E$2:$K$3,2,0))","v":"."},{"$f":"IF(N6=\"\",\"\",IF(Cover!$C$14>1996,'Time Units'!$D$4,CONCATENATE(O6,\"_\",Cover!$C$14)))","v":"childcare1_TU_1968"},false,{"$f":"IF(N6=\"\",\"\",IF(R6,INDEX('Time Units'!$B:$K,MATCH(Q6,'Time Units'!$D:$D,0),MATCH(M6,'Time Units'!$B$2:$K$2,0)),0))","v":0},0,"childcare1_TU == 0",{"$f":"IF(N6=\"\",\"\",CONCATENATE(\"replace \",O6,\"_\",Cover!$C$14,\" = \",P6,\" if \",U6))","v":"replace childcare1_TU_1968 = . if childcare1_TU == 0"},{"$f":"IF(N6=\"\",\"\",CONCATENATE(LEFT(O6,LEN(O6)-3),\"_\",Cover!$C$14))","v":"childcare1_1968"},"replace childcare1_1968 = childcare1_1968",0]
[null,"DOLLARS PER WHAT",{"$f":"IF(B7=\"\",\"\",OFFSET(Variables!$E$2,MATCH(B7,Variables!$H$3:$H$45,0),0))","v":"rent2_TU"},{"$f":"IFERROR(INDEX(Variables!$B$2:$AT$45,MATCH($B7,Variables!$H$2:$H$45,0),MATCH(\"Included?\",Variables!$B$2:$AT$2,0)),\"\")","v":"Y"},{"$f":"IFERROR(IF(INDEX(Variables!$1:$1048576,MATCH(B7,Variables!$H:$H,0),MATCH(Cover!$C$14,Variables!$2:$2,0))=\"-\",\"N\",\"Y\"),\"\")","v":"N"},null,"* Variable rent2_TU not included in data set",null,4,"",null,1,"2 Wks","CHILD CARE COST PER",{"$f":"IF(N7=\"\",\"\",OFFSET(Variables!$E$2,MATCH(N7,Variables!$H$3:$H$45,0),0))","v":"childcare1_TU"},{"$f":"IF(N7=\"\",\"\",HLOOKUP(M7,'Time Units'!$E$2:$K$3,2,0))","v":26},{"$f":"IF(N7=\"\",\"\",IF(Cover!$C$14>1996,'Time Units'!$D$4,CONCATENATE(O7,\"_\",Cover!$C$14)))","v":"childcare1_TU_1968"},false,{"$f":"IF(N7=\"\",\"\",IF(R7,INDEX('Time Units'!$B:$K,MATCH(Q7,'Time Units'!$D:$D,0),MATCH(M7,'Time Units'!$B$2:$K$2,0)),0))","v":0},0,"childcare1_TU == 0",{"$f":"IF(N7=\"\",\"\",CONCATENATE(\"replace \",O7,\"_\",Cover!$C$14,\" = \",P7,\" if \",U7))","v":"replace childcare1_TU_1968 = 26 if childcare1_TU == 0"},{"$f":"IF(N7=\"\",\"\",CONCATENATE(LEFT(O7,LEN(O7)-3),\"_\",Cover!$C$14))","v":"childcare1_1968"},"replace childcare1_1968 = childcare1_1968",0]
[null,"TIME UNIT-HD RPRTD UNEMPL COMP",{"$f":"IF(B8=\"\",\"\",OFFSET(Variables!$E$2,MATCH(B8,Variables!$H$3:$H$45,0),0))","v":"unemp_inc4_TU"},{"$f":"IFERROR(INDEX(Variables!$B$2:$AT$45,MATCH($B8,Variables!$H$2:$H$45,0),MATCH(\"Included?\",Variables!$B$2:$AT$2,0)),\"\")","v":"Y"},{"$f":"IFERROR(IF(INDEX(Variables!$1:$1048576,MATCH(B8,Variables!$H:$H,0),MATCH(Cover!$C$14,Variables!$2:$2,0))=\"-\",\"N\",\"Y\"),\"\")","v":"N"},null,"* Variable unemp_inc4_TU not included in data set",null,5,"",null,1,"Month","CHILD CARE COST PER",{"$f":"IF(N8=\"\",\"\",OFFSET(Variables!$E$2,MATCH(N8,Variables!$H$3:$H$45,0),0))","v":"childcare1_TU"},{"$f":"IF(N8=\"\",\"\",HLOOKUP(M8,'Time Units'!$E$2:$K$3,2,0))","v":12},{"$f":"IF(N8=\"\",\"\",IF(Cover!$C$14>1996,'Time Units'!$D$4,CONCATENATE(O8,\"_\",Cover!$C$14)))","v":"childcare1_TU_1968"},false,{"$f":"IF(N8=\"\",\"\",IF(R8,INDEX('Time Units'!$B:$K,MATCH(Q8,'Time Units'!$D:$D,0),MATCH(M8,'Time Units'!$B$2:$K$2,0)),0))","v":0},0,"childcare1_TU == 0",{"$f":"IF(N8=\"\",\"\",CONCATENATE(\"replace \",O8,\"_\",Cover!$C$14,\" = \",P8,\" if \",U8))","v":"replace childcare1_TU_1968 = 12 if childcare1_TU == 0"},{"$f":"IF(N8=\"\",\"\",CONCATENATE(LEFT(O8,LEN(O8)-3),\"_\",Cover!$C$14))","v":"childcare1_1968"},"replace childcare1_1968 = childcare1_1968",0]
[null,"TIME UNIT-WF REPORTED UNEMP COMP",{"$f":"IF(B9=\"\",\"\",OFFSET(Variables!$E$2,MATCH(B9,Variables!$H$3:$H$45,0),0))","v":"unemp_inc6_TU"},{"$f":"IFERROR(INDEX(Variables!$B$2:$AT$45,MATCH($B9,Variables!$H$2:$H$45,0),MATCH(\"Included?\",Variables!$B$2:$AT$2,0)),\"\")","v":"Y"},{"$f":"IFERROR(IF(INDEX(Variables!$1:$1048576,MATCH(B9,Variables!$H:$H,0),MATCH(Cover!$C$14,Variables!$2:$2,0))=\"-\",\"N\",\"Y\"),\"\")","v":"N"},null,"* Variable unemp_inc6_TU not included in data set",null,6,"",null,1,"Year","CHILD CARE COST PER",{"$f":"IF(N9=\"\",\"\",OFFSET(Variables!$E$2,MATCH(N9,Variables!$H$3:$H$45,0),0))","v":"childcare1_TU"},{"$f":"IF(N9=\"\",\"\",HLOOKUP(M9,'Time Units'!$E$2:$K$3,2,0))","v":1},{"$f":"IF(N9=\"\",\"\",IF(Cover!$C$14>1996,'Time Units'!$D$4,CONCATENATE(O9,\"_\",Cover!$C$14)))","v":"childcare1_TU_1968"},false,{"$f":"IF(N9=\"\",\"\",IF(R9,INDEX('Time Units'!$B:$K,MATCH(Q9,'Time Units'!$D:$D,0),MATCH(M9,'Time Units'!$B$2:$K$2,0)),0))","v":0},0,"childcare1_TU == 0",{"$f":"IF(N9=\"\",\"\",CONCATENATE(\"replace \",O9,\"_\",Cover!$C$14,\" = \",P9,\" if \",U9))","v":"replace childcare1_TU_1968 = 1 if childcare1_TU == 0"},{"$f":"IF(N9=\"\",\"\",CONCATENATE(LEFT(O9,LEN(O9)-3),\"_\",Cover!$C$14))","v":"childcare1_1968"},"replace childcare1_1968 = childcare1_1968",0]
[null,null,{"$f":"IF(B10=\"\",\"\",OFFSET(Variables!$E$2,MATCH(B10,Variables!$H$3:$H$45,0),0))","v":""},{"$f":"IFERROR(INDEX(Variables!$B$2:$AT$45,MATCH($B10,Variables!$H$2:$H$45,0),MATCH(\"Included?\",Variables!$B$2:$AT$2,0)),\"\")","v":""},{"$f":"IFERROR(IF(INDEX(Variables!$1:$1048576,MATCH(B10,Variables!$H:$H,0),MATCH(Cover!$C$14,Variables!$2:$2,0))=\"-\",\"N\",\"Y\"),\"\")","v":""},null,"",null,7,"",null,1,"Inap","CHILD CARE COST PER",{"$f":"IF(N10=\"\",\"\",OFFSET(Variables!$E$2,MATCH(N10,Variables!$H$3:$H$45,0),0))","v":"childcare1_TU"},{"$f":"IF(N10=\"\",\"\",HLOOKUP(M10,'Time Units'!$E$2:$K$3,2,0))","v":0},{"$f":"IF(N10=\"\",\"\",IF(Cover!$C$14>1996,'Time Units'!$D$4,CONCATENATE(O10,\"_\",Cover!$C$14)))","v":"childcare1_TU_1968"},false,{"$f":"IF(N10=\"\",\"\",IF(R10,INDEX('Time Units'!$B:$K,MATCH(Q10,'Time Units'!$D:$D,0),MATCH(M10,'Time Units'!$B$2:$K$2,0)),0))","v":0},0,"childcare1_TU == 0",{"$f":"IF(N10=\"\",\"\",CONCATENATE(\"replace \",O10,\"_\",Cover!$C$14,\" = \",P10,\" if \",U10))","v":"replace childcare1_TU_1968 = 0 if childcare1_TU == 0"},{"$f":"IF(N10=\"\",\"\",CONCATENATE(LEFT(O10,LEN(O10)-3),\"_\",Cover!$C$14))","v":"childcare1_1968"},"replace childcare1_1968 = childcare1_1968",0]
[null,null,{"$f":"IF(B11=\"\",\"\",OFFSET(Variables!$E$2,MATCH(B11,Variables!$H$3:$H$45,0),0))","v":""},{"$f":"IFERROR(INDEX(Variables!$B$2:$AT$45,MATCH($B11,Variables!$H$2:$H$45,0),MATCH(\"Included?\",Variables!$B$2:$AT$2,0)),\"\")","v":""},{"$f":"IFERROR(IF(INDEX(Variables!$1:$1048576,MATCH(B11,Variables!$H:$H,0),MATCH(Cover!$C$14,Variables!$2:$2,0))=\"-\",\"N\",\"Y\"),\"\")","v":""},null,"",null,8,"",null,{"$f":"L4+1","v":2},{"$f":"M4","v":"Hour"},"TIME UNIT-WF RPRTD PENSION/ANNUITY",{"$f":"IF(N11=\"\",\"\",OFFSET(Variables!$E$2,MATCH(N11,Variables!$H$3:$H$45,0),0))","v":"pension_inc6_TU"},{"$f":"IF(N11=\"\",\"\",HLOOKUP(M11,'Time Units'!$E$2:$K$3,2,0))","v":"."},{"$f":"IF(N11=\"\",\"\",IF(Cover!$C$14>1996,'Time Units'!$D$4,CONCATENATE(O11,\"_\",Cover!$C$14)))","v":"pension_inc6_TU_1968"},false,{"$f":"IF(N11=\"\",\"\",IF(R11,INDEX('Time Units'!$B:$K,MATCH(Q11,'Time Units'!$D:$D,0),MATCH(M11,'Time Units'!$B$2:$K$2,0)),0))","v":0},0,"pension_inc6_TU == 0",{"$f":"IF(N11=\"\",\"\",CONCATENATE(\"replace \",O11,\"_\",Cover!$C$14,\" = \",P11,\" if \",U11))","v":"replace pension_inc6_TU_1968 = . if pension_inc6_TU == 0"},{"$f":"IF(N11=\"\",\"\",CONCATENATE(LEFT(O11,LEN(O11)-3),\"_\",Cover!$C$14))","v":"pension_inc6_1968"},"replace pension_inc6_1968 = pension_inc6_1968",0]
[null,null,{"$f":"IF(B12=\"\",\"\",OFFSET(Variables!$E$2,MATCH(B12,Variables!$H$3:$H$45,0),0))","v":""},{"$f":"IFERROR(INDEX(Variables!$B$2:$AT$45,MATCH($B12,Variables!$H$2:$H$45,0),MATCH(\"Included?\",Variables!$B$2:$AT$2,0)),\"\")","v":""},{"$f":"IFERROR(IF(INDEX(Variables!$1:$1048576,MATCH(B12,Variables!$H:$H,0),MATCH(Cover!$C$14,Variables!$2:$2,0))=\"-\",\"N\",\"Y\"),\"\")","v":""},null,"",null,9,"",null,2,{"$f":"M5","v":"Day"},"TIME UNIT-WF RPRTD PENSION/ANNUITY",{"$f":"IF(N12=\"\",\"\",OFFSET(Variables!$E$2,MATCH(N12,Variables!$H$3:$H$45,0),0))","v":"pension_inc6_TU"},{"$f":"IF(N12=\"\",\"\",HLOOKUP(M12,'Time Units'!$E$2:$K$3,2,0))","v":"."},{"$f":"IF(N12=\"\",\"\",IF(Cover!$C$14>1996,'Time Units'!$D$4,CONCATENATE(O12,\"_\",Cover!$C$14)))","v":"pension_inc6_TU_1968"},false,{"$f":"IF(N12=\"\",\"\",IF(R12,INDEX('Time Units'!$B:$K,MATCH(Q12,'Time Units'!$D:$D,0),MATCH(M12,'Time Units'!$B$2:$K$2,0)),0))","v":0},0,"pension_inc6_TU == 0",{"$f":"IF(N12=\"\",\"\",CONCATENATE(\"replace \",O12,\"_\",Cover!$C$14,\" = \",P12,\" if \",U12))","v":"replace pension_inc6_TU_1968 = . if pension_inc6_TU == 0"},{"$f":"IF(N12=\"\",\"\",CONCATENATE(LEFT(O12,LEN(O12)-3),\"_\",Cover!$C$14))","v":"pension_inc6_1968"},"replace pension_inc6_1968 = pension_inc6_1968",0]
[null,null,{"$f":"IF(B13=\"\",\"\",OFFSET(Variables!$E$2,MATCH(B13,Variables!$H$3:$H$45,0),0))","v":""},{"$f":"IFERROR(INDEX(Variables!$B$2:$AT$45,MATCH($B13,Variables!$H$2:$H$45,0),MATCH(\"Included?\",Variables!$B$2:$AT$2,0)),\"\")","v":""},{"$f":"IFERROR(IF(INDEX(Variables!$1:$1048576,MATCH(B13,Variables!$H:$H,0),MATCH(Cover!$C$14,Variables!$2:$2,0))=\"-\",\"N\",\"Y\"),\"\")","v":""},null,"",null,10,"",null,2,"Week","TIME UNIT-WF RPRTD PENSION/ANNUITY",{"$f":"IF(N13=\"\",\"\",OFFSET(Variables!$E$2,MATCH(N13,Variables!$H$3:$H$45,0),0))","v":"pension_inc6_TU"},{"$f":"IF(N13=\"\",\"\",HLOOKUP(M13,'Time Units'!$E$2:$K$3,2,0))","v":"."},{"$f":"IF(N13=\"\",\"\",IF(Cover!$C$14>1996,'Time Units'!$D$4,CONCATENATE(O13,\"_\",Cover!$C$14)))","v":"pension_inc6_TU_1968"},false,{"$f":"IF(N13=\"\",\"\",IF(R13,INDEX('Time Units'!$B:$K,MATCH(Q13,'Time Units'!$D:$D,0),MATCH(M13,'Time Units'!$B$2:$K$2,0)),0))","v":0},0,"pension_inc6_TU == 0",{"$f":"IF(N13=\"\",\"\",CONCATENATE(\"replace \",O13,\"_\",Cover!$C$14,\" = \",P13,\" if \",U13))","v":"replace pension_inc6_TU_1968 = . if pension_inc6_TU == 0"},{"$f":"IF(N13=\"\",\"\",CONCATENATE(LEFT(O13,LEN(O13)-3),\"_\",Cover!$C$14))","v":"pension_inc6_1968"},"replace pension_inc6_1968 = pension_inc6_1968",0]
[null,null,null,null,null,null,"",null,11,"",null,2,"2 Wks","TIME UNIT-WF RPRTD PENSION/ANNUITY",{"$f":"IF(N14=\"\",\"\",OFFSET(Variables!$E$2,MATCH(N14,Variables!$H$3:$H$45,0),0))","v":"pension_inc6_TU"},{"$f":"IF(N14=\"\",\"\",HLOOKUP(M14,'Time Units'!$E$2:$K$3,2,0))","v":26},{"$f":"IF(N14=\"\",\"\",IF(Cover!$C$14>1996,'Time Units'!$D$4,CONCATENATE(O14,\"_\",Cover!$C$14)))","v":"pension_inc6_TU_1968"},false,{"$f":"IF(N14=\"\",\"\",IF(R14,INDEX('Time Units'!$B:$K,MATCH(Q14,'Time Units'!$D:$D,0),MATCH(M14,'Time Units'!$B$2:$K$2,0)),0))","v":0},0,"pension_inc6_TU == 0",{"$f":"IF(N14=\"\",\"\",CONCATENATE(\"replace \",O14,\"_\",Cover!$C$14,\" = \",P14,\" if \",U14))","v":"replace pension_inc6_TU_1968 = 26 if pension_inc6_TU == 0"},{"$f":"IF(N14=\"\",\"\",CONCATENATE(LEFT(O14,LEN(O14)-3),\"_\",Cover!$C$14))","v":"pension_inc6_1968"},"replace pension_inc6_1968 = pension_inc6_1968",0]
[null,null,null,null,null,null,"",null,12,"",null,2,"Month","TIME UNIT-WF RPRTD PENSION/ANNUITY",{"$f":"IF(N15=\"\",\"\",OFFSET(Variables!$E$2,MATCH(N15,Variables!$H$3:$H$45,0),0))","v":"pension_inc6_TU"},{"$f":"IF(N15=\"\",\"\",HLOOKUP(M15,'Time Units'!$E$2:$K$3,2,0))","v":12},{"$f":"IF(N15=\"\",\"\",IF(Cover!$C$14>1996,'Time Units'!$D$4,CONCATENATE(O15,\"_\",Cover!$C$14)))","v":"pension_inc6_TU_1968"},false,{"$f":"IF(N15=\"\",\"\",IF(R15,INDEX('Time Units'!$B:$K,MATCH(Q15,'Time Units'!$D:$D,0),MATCH(M15,'Time Units'!$B$2:$K$2,0)),0))","v":0},0,"pension_inc6_TU == 0",{"$f":"IF(N15=\"\",\"\",CONCATENATE(\"replace \",O15,\"_\",Cover!$C$14,\" = \",P15,\" if \",U15))","v":"replace pension_inc6_TU_1968 = 12 if pension_inc6_TU == 0"},{"$f":"IF(N15=\"\",\"\",CONCATENATE(LEFT(O15,LEN(O15)-3),\"_\",Cover!$C$14))","v":"pension_inc6_1968"},"replace pension_inc6_1968 = pension_inc6_1968",0]
[null,null,null,null,null,null,"",null,13,"",null,2,"Year","TIME UNIT-WF RPRTD PENSION/ANNUITY",{"$f":"IF(N16=\"\",\"\",OFFSET(Variables!$E$2,MATCH(N16,Variables!$H$3:$H$45,0),0))","v":"pension_inc6_TU"},{"$f":"IF(N16=\"\",\"\",HLOOKUP(M16,'Time Units'!$E$2:$K$3,2,0))","v":1},{"$f":"IF(N16=\"\",\"\",IF(Cover!$C$14>1996,'Time Units'!$D$4,CONCATENATE(O16,\"_\",Cover!$C$14)))","v":"pension_inc6_TU_1968"},false,{"$f":"IF(N16=\"\",\"\",IF(R16,INDEX('Time Units'!$B:$K,MATCH(Q16,'Time Units'!$D:$D,0),MATCH(M16,'Time Units'!$B$2:$K$2,0)),0))","v":0},0,"pension_inc6_TU == 0",{"$f":"IF(N16=\"\",\"\",CONCATENATE(\"replace \",O16,\"_\",Cover!$C$14,\" = \",P16,\" if \",U16))","v":"replace pension_inc6_TU_1968 = 1 if pension_inc6_TU == 0"},{"$f":"IF(N16=\"\",\"\",CONCATENATE(LEFT(O16,LEN(O16)-3),\"_\",Cover!$C$14))","v":"pension_inc6_1968"},"replace pension_inc6_1968 = pension_inc6_1968",0]
[null,null,null,null,null,null,"",null,14,"",null,2,"Inap","TIME UNIT-WF RPRTD PENSION/ANNUITY",{"$f":"IF(N17=\"\",\"\",OFFSET(Variables!$E$2,MATCH(N17,Variables!$H$3:$H$45,0),0))","v":"pension_inc6_TU"},{"$f":"IF(N17=\"\",\"\",HLOOKUP(M17,'Time Units'!$E$2:$K$3,2,0))","v":0},{"$f":"IF(N17=\"\",\"\",IF(Cover!$C$14>1996,'Time Units'!$D$4,CONCATENATE(O17,\"_\",Cover!$C$14)))","v":"pension_inc6_TU_1968"},false,{"$f":"IF(N17=\"\",\"\",IF(R17,INDEX('Time Units'!$B:$K,MATCH(Q17,'Time Units'!$D:$D,0),MATCH(M17,'Time Units'!$B$2:$K$2,0)),0))","v":0},0,"pension_inc6_TU == 0",{"$f":"IF(N17=\"\",\"\",CONCATENATE(\"replace \",O17,\"_\",Cover!$C$14,\" = \",P17,\" if \",U17))","v":"replace pension_inc6_TU_1968 = 0 if pension_inc6_TU == 0"},{"$f":"IF(N17=\"\",\"\",CONCATENATE(LEFT(O17,LEN(O17)-3),\"_\",Cover!$C$14))","v":"pension_inc6_1968"},"replace pension_inc6_1968 = pension_inc6_1968",0]
[null,null,null,null,null,null,"",null,15,"",null,3,"Hour","TIME UNIT-HD RPRTD ANNUITIES/IRAS",{"$f":"IF(N18=\"\",\"\",OFFSET(Variables!$E$2,MATCH(N18,Variables!$H$3:$H$45,0),0))","v":"pension_inc8_TU"},{"$f":"IF(N18=\"\",\"\",HLOOKUP(M18,'Time Units'!$E$2:$K$3,2,0))","v":"."},{"$f":"IF(N18=\"\",\"\",IF(Cover!$C$14>1996,'Time Units'!$D$4,CONCATENATE(O18,\"_\",Cover!$C$14)))","v":"pension_inc8_TU_1968"},false,{"$f":"IF(N18=\"\",\"\",IF(R18,INDEX('Time Units'!$B:$K,MATCH(Q18,'Time Units'!$D:$D,0),MATCH(M18,'Time Units'!$B$2:$K$2,0)),0))","v":0},0,"pension_inc8_TU == 0",{"$f":"IF(N18=\"\",\"\",CONCATENATE(\"replace \",O18,\"_\",Cover!$C$14,\" = \",P18,\" if \",U18))","v":"replace pension_inc8_TU_1968 = . if pension_inc8_TU == 0"},{"$f":"IF(N18=\"\",\"\",CONCATENATE(LEFT(O18,LEN(O18)-3),\"_\",Cover!$C$14))","v":"pension_inc8_1968"},"replace pension_inc8_1968 = pension_inc8_1968",0]
[null,null,null,null,null,null,"",null,16,"",null,3,"Day","TIME UNIT-HD RPRTD ANNUITIES/IRAS",{"$f":"IF(N19=\"\",\"\",OFFSET(Variables!$E$2,MATCH(N19,Variables!$H$3:$H$45,0),0))","v":"pension_inc8_TU"},{"$f":"IF(N19=\"\",\"\",HLOOKUP(M19,'Time Units'!$E$2:$K$3,2,0))","v":"."},{"$f":"IF(N19=\"\",\"\",IF(Cover!$C$14>1996,'Time Units'!$D$4,CONCATENATE(O19,\"_\",Cover!$C$14)))","v":"pension_inc8_TU_1968"},false,{"$f":"IF(N19=\"\",\"\",IF(R19,INDEX('Time Units'!$B:$K,MATCH(Q19,'Time Units'!$D:$D,0),MATCH(M19,'Time Units'!$B$2:$K$2,0)),0))","v":0},0,"pension_inc8_TU == 0",{"$f":"IF(N19=\"\",\"\",CONCATENATE(\"replace \",O19,\"_\",Cover!$C$14,\" = \",P19,\" if \",U19))","v":"replace pension_inc8_TU_1968 = . if pension_inc8_TU == 0"},{"$f":"IF(N19=\"\",\"\",CONCATENATE(LEFT(O19,LEN(O19)-3),\"_\",Cover!$C$14))","v":"pension_inc8_1968"},"replace pension_inc8_1968 = pension_inc8_1968",0]
[null,null,null,null,null,null,"",null,17,"",null,3,"Week","TIME UNIT-HD RPRTD ANNUITIES/IRAS",{"$f":"IF(N20=\"\",\"\",OFFSET(Variables!$E$2,MATCH(N20,Variables!$H$3:$H$45,0),0))","v":"pension_inc8_TU"},{"$f":"IF(N20=\"\",\"\",HLOOKUP(M20,'Time Units'!$E$2:$K$3,2,0))","v":"."},{"$f":"IF(N20=\"\",\"\",IF(Cover!$C$14>1996,'Time Units'!$D$4,CONCATENATE(O20,\"_\",Cover!$C$14)))","v":"pension_inc8_TU_1968"},false,{"$f":"IF(N20=\"\",\"\",IF(R20,INDEX('Time Units'!$B:$K,MATCH(Q20,'Time Units'!$D:$D,0),MATCH(M20,'Time Units'!$B$2:$K$2,0)),0))","v":0},0,"pension_inc8_TU == 0",{"$f":"IF(N20=\"\",\"\",CONCATENATE(\"replace \",O20,\"_\",Cover!$C$14,\" = \",P20,\" if \",U20))","v":"replace pension_inc8_TU_1968 = . if pension_inc8_TU == 0"},{"$f":"IF(N20=\"\",\"\",CONCATENATE(LEFT(O20,LEN(O20)-3),\"_\",Cover!$C$14))","v":"pension_inc8_1968"},"replace pension_inc8_1968 = pension_inc8_1968",0]
[null,null,null,null,null,null,"",null,18,"",null,3,"2 Wks","TIME UNIT-HD RPRTD ANNUITIES/IRAS",{"$f":"IF(N21=\"\",\"\",OFFSET(Variables!$E$2,MATCH(N21,Variables!$H$3:$H$45,0),0))","v":"pension_inc8_TU"},{"$f":"IF(N21=\"\",\"\",HLOOKUP(M21,'Time Units'!$E$2:$K$3,2,0))","v":26},{"$f":"IF(N21=\"\",\"\",IF(Cover!$C$14>1996,'Time Units'!$D$4,CONCATENATE(O21,\"_\",Cover!$C$14)))","v":"pension_inc8_TU_1968"},false,{"$f":"IF(N21=\"\",\"\",IF(R21,INDEX('Time Units'!$B:$K,MATCH(Q21,'Time Units'!$D:$D,0),MATCH(M21,'Time Units'!$B$2:$K$2,0)),0))","v":0},0,"pension_inc8_TU == 0",{"$f":"IF(N21=\"\",\"\",CONCATENATE(\"replace \",O21,\"_\",Cover!$C$14,\" = \",P21,\" if \",U21))","v":"replace pension_inc8_TU_1968 = 26 if pension_inc8_TU == 0"},{"$f":"IF(N21=\"\",\"\",CONCATENATE(LEFT(O21,LEN(O21)-3),\"_\",Cover!$C$14))","v":"pension_inc8_1968"},"replace pension_inc8_1968 = pension_inc8_1968",0]
[null,null,null,null,null,null,"",null,19,"",null,3,"Month","TIME UNIT-HD RPRTD ANNUITIES/IRAS",{"$f":"IF(N22=\"\",\"\",OFFSET(Variables!$E$2,MATCH(N22,Variables!$H$3:$H$45,0),0))","v":"pension_inc8_TU"},{"$f":"IF(N22=\"\",\"\",HLOOKUP(M22,'Time Units'!$E$2:$K$3,2,0))","v":12},{"$f":"IF(N22=\"\",\"\",IF(Cover!$C$14>1996,'Time Units'!$D$4,CONCATENATE(O22,\"_\",Cover!$C$14)))","v":"pension_inc8_TU_1968"},false,{"$f":"IF(N22=\"\",\"\",IF(R22,INDEX('Time Units'!$B:$K,MATCH(Q22,'Time Units'!$D:$D,0),MATCH(M22,'Time Units'!$B$2:$K$2,0)),0))","v":0},0,"pension_inc8_TU == 0",{"$f":"IF(N22=\"\",\"\",CONCATENATE(\"replace \",O22,\"_\",Cover!$C$14,\" = \",P22,\" if \",U22))","v":"replace pension_inc8_TU_1968 = 12 if pension_inc8_TU == 0"},{"$f":"IF(N22=\"\",\"\",CONCATENATE(LEFT(O22,LEN(O22)-3),\"_\",Cover!$C$14))","v":"pension_inc8_1968"},"replace pension_inc8_1968 = pension_inc8_1968",0]
[null,null,null,null,null,null,"",null,20,"",null,3,"Year","TIME UNIT-HD RPRTD ANNUITIES/IRAS",{"$f":"IF(N23=\"\",\"\",OFFSET(Variables!$E$2,MATCH(N23,Variables!$H$3:$H$45,0),0))","v":"pension_inc8_TU"},{"$f":"IF(N23=\"\",\"\",HLOOKUP(M23,'Time Units'!$E$2:$K$3,2,0))","v":1},{"$f":"IF(N23=\"\",\"\",IF(Cover!$C$14>1996,'Time Units'!$D$4,CONCATENATE(O23,\"_\",Cover!$C$14)))","v":"pension_inc8_TU_1968"},false,{"$f":"IF(N23=\"\",\"\",IF(R23,INDEX('Time Units'!$B:$K,MATCH(Q23,'Time Units'!$D:$D,0),MATCH(M23,'Time Units'!$B$2:$K$2,0)),0))","v":0},0,"pension_inc8_TU == 0",{"$f":"IF(N23=\"\",\"\",CONCATENATE(\"replace \",O23,\"_\",Cover!$C$14,\" = \",P23,\" if \",U23))","v":"replace pension_inc8_TU_1968 = 1 if pension_inc8_TU == 0"},{"$f":"IF(N23=\"\",\"\",CONCATENATE(LEFT(O23,LEN(O23)-3),\"_\",Cover!$C$14))","v":"pension_inc8_1968"},"replace pension_inc8_1968 = pension_inc8_1968",0]
[null,null,null,null,null,null,"",null,21,"",null,3,"Inap","TIME UNIT-HD RPRTD ANNUITIES/IRAS",{"$f":"IF(N24=\"\",\"\",OFFSET(Variables!$E$2,MATCH(N24,Variables!$H$3:$H$45,0),0))","v":"pension_inc8_TU"},{"$f":"IF(N24=\"\",\"\",HLOOKUP(M24,'Time Units'!$E$2:$K$3,2,0))","v":0},{"$f":"IF(N24=\"\",\"\",IF(Cover!$C$14>1996,'Time Units'!$D$4,CONCATENATE(O24,\"_\",Cover!$C$14)))","v":"pension_inc8_TU_1968"},false,{"$f":"IF(N24=\"\",\"\",IF(R24,INDEX('Time Units'!$B:$K,MATCH(Q24,'Time Units'!$D:$D,0),MATCH(M24,'Time Units'!$B$2:$K$2,0)),0))","v":0},0,"pension_inc8_TU == 0",{"$f":"IF(N24=\"\",\"\",CONCATENATE(\"replace \",O24,\"_\",Cover!$C$14,\" = \",P24,\" if \",U24))","v":"replace pension_inc8_TU_1968 = 0 if pension_inc8_TU == 0"},{"$f":"IF(N24=\"\",\"\",CONCATENATE(LEFT(O24,LEN(O24)-3),\"_\",Cover!$C$14))","v":"pension_inc8_1968"},"replace pension_inc8_1968 = pension_inc8_1968",0]
[null,null,null,null,null,null,"",null,22,"",null,4,"Hour","DOLLARS PER WHAT",{"$f":"IF(N25=\"\",\"\",OFFSET(Variables!$E$2,MATCH(N25,Variables!$H$3:$H$45,0),0))","v":"rent2_TU"},{"$f":"IF(N25=\"\",\"\",HLOOKUP(M25,'Time Units'!$E$2:$K$3,2,0))","v":"."},{"$f":"IF(N25=\"\",\"\",IF(Cover!$C$14>1996,'Time Units'!$D$4,CONCATENATE(O25,\"_\",Cover!$C$14)))","v":"rent2_TU_1968"},false,{"$f":"IF(N25=\"\",\"\",IF(R25,INDEX('Time Units'!$B:$K,MATCH(Q25,'Time Units'!$D:$D,0),MATCH(M25,'Time Units'!$B$2:$K$2,0)),0))","v":0},0,"rent2_TU == 0",{"$f":"IF(N25=\"\",\"\",CONCATENATE(\"replace \",O25,\"_\",Cover!$C$14,\" = \",P25,\" if \",U25))","v":"replace rent2_TU_1968 = . if rent2_TU == 0"},{"$f":"IF(N25=\"\",\"\",CONCATENATE(LEFT(O25,LEN(O25)-3),\"_\",Cover!$C$14))","v":"rent2_1968"},"replace rent2_1968 = rent2_1968",0]
[null,null,null,null,null,null,"",null,23,"",null,4,"Day","DOLLARS PER WHAT",{"$f":"IF(N26=\"\",\"\",OFFSET(Variables!$E$2,MATCH(N26,Variables!$H$3:$H$45,0),0))","v":"rent2_TU"},{"$f":"IF(N26=\"\",\"\",HLOOKUP(M26,'Time Units'!$E$2:$K$3,2,0))","v":"."},{"$f":"IF(N26=\"\",\"\",IF(Cover!$C$14>1996,'Time Units'!$D$4,CONCATENATE(O26,\"_\",Cover!$C$14)))","v":"rent2_TU_1968"},false,{"$f":"IF(N26=\"\",\"\",IF(R26,INDEX('Time Units'!$B:$K,MATCH(Q26,'Time Units'!$D:$D,0),MATCH(M26,'Time Units'!$B$2:$K$2,0)),0))","v":0},0,"rent2_TU == 0",{"$f":"IF(N26=\"\",\"\",CONCATENATE(\"replace \",O26,\"_\",Cover!$C$14,\" = \",P26,\" if \",U26))","v":"replace rent2_TU_1968 = . if rent2_TU == 0"},{"$f":"IF(N26=\"\",\"\",CONCATENATE(LEFT(O26,LEN(O26)-3),\"_\",Cover!$C$14))","v":"rent2_1968"},"replace rent2_1968 = rent2_1968",0]
[null,null,null,null,null,null,"",null,24,"",null,4,"Week","DOLLARS PER WHAT",{"$f":"IF(N27=\"\",\"\",OFFSET(Variables!$E$2,MATCH(N27,Variables!$H$3:$H$45,0),0))","v":"rent2_TU"},{"$f":"IF(N27=\"\",\"\",HLOOKUP(M27,'Time Units'!$E$2:$K$3,2,0))","v":"."},{"$f":"IF(N27=\"\",\"\",IF(Cover!$C$14>1996,'Time Units'!$D$4,CONCATENATE(O27,\"_\",Cover!$C$14)))","v":"rent2_TU_1968"},false,{"$f":"IF(N27=\"\",\"\",IF(R27,INDEX('Time Units'!$B:$K,MATCH(Q27,'Time Units'!$D:$D,0),MATCH(M27,'Time Units'!$B$2:$K$2,0)),0))","v":0},0,"rent2_TU == 0",{"$f":"IF(N27=\"\",\"\",CONCATENATE(\"replace \",O27,\"_\",Cover!$C$14,\" = \",P27,\" if \",U27))","v":"replace rent2_TU_1968 = . if rent2_TU == 0"},{"$f":"IF(N27=\"\",\"\",CONCATENATE(LEFT(O27,LEN(O27)-3),\"_\",Cover!$C$14))","v":"rent2_1968"},"replace rent2_1968 = rent2_1968",0]
[null,null,null,null,null,null,"",null,25,"",null,4,"2 Wks","DOLLARS PER WHAT",{"$f":"IF(N28=\"\",\"\",OFFSET(Variables!$E$2,MATCH(N28,Variables!$H$3:$H$45,0),0))","v":"rent2_TU"},{"$f":"IF(N28=\"\",\"\",HLOOKUP(M28,'Time Units'!$E$2:$K$3,2,0))","v":26},{"$f":"IF(N28=\"\",\"\",IF(Cover!$C$14>1996,'Time Units'!$D$4,CONCATENATE(O28,\"_\",Cover!$C$14)))","v":"rent2_TU_1968"},false,{"$f":"IF(N28=\"\",\"\",IF(R28,INDEX('Time Units'!$B:$K,MATCH(Q28,'Time Units'!$D:$D,0),MATCH(M28,'Time Units'!$B$2:$K$2,0)),0))","v":0},0,"rent2_TU == 0",{"$f":"IF(N28=\"\",\"\",CONCATENATE(\"replace \",O28,\"_\",Cover!$C$14,\" = \",P28,\" if \",U28))","v":"replace rent2_TU_1968 = 26 if rent2_TU == 0"},{"$f":"IF(N28=\"\",\"\",CONCATENATE(LEFT(O28,LEN(O28)-3),\"_\",Cover!$C$14))","v":"rent2_1968"},"replace rent2_1968 = rent2_1968",0]
[null,null,null,null,null,null,"",null,26,"",null,4,"Month","DOLLARS PER WHAT",{"$f":"IF(N29=\"\",\"\",OFFSET(Variables!$E$2,MATCH(N29,Variables!$H$3:$H$45,0),0))","v":"rent2_TU"},{"$f":"IF(N29=\"\",\"\",HLOOKUP(M29,'Time Units'!$E$2:$K$3,2,0))","v":12},{"$f":"IF(N29=\"\",\"\",IF(Cover!$C$14>1996,'Time Units'!$D$4,CONCATENATE(O29,\"_\",Cover!$C$14)))","v":"rent2_TU_1968"},false,{"$f":"IF(N29=\"\",\"\",IF(R29,INDEX('Time Units'!$B:$K,MATCH(Q29,'Time Units'!$D:$D,0),MATCH(M29,'Time Units'!$B$2:$K$2,0)),0))","v":0},0,"rent2_TU == 0",{"$f":"IF(N29=\"\",\"\",CONCATENATE(\"replace \",O29,\"_\",Cover!$C$14,\" = \",P29,\" if \",U29))","v":"replace rent2_TU_1968 = 12 if rent2_TU == 0"},{"$f":"IF(N29=\"\",\"\",CONCATENATE(LEFT(O29,LEN(O29)-3),\"_\",Cover!$C$14))","v":"rent2_1968"},"replace rent2_1968 = rent2_1968",0]
[null,null,null,null,null,null,"",null,27,"",null,4,"Year","DOLLARS PER WHAT",{"$f":"IF(N30=\"\",\"\",OFFSET(Variables!$E$2,MATCH(N30,Variables!$H$3:$H$45,0),0))","v":"rent2_TU"},{"$f":"IF(N30=\"\",\"\",HLOOKUP(M30,'Time Units'!$E$2:$K$3,2,0))","v":1},{"$f":"IF(N30=\"\",\"\",IF(Cover!$C$14>1996,'Time Units'!$D$4,CONCATENATE(O30,\"_\",Cover!$C$14)))","v":"rent2_TU_1968"},false,{"$f":"IF(N30=\"\",\"\",IF(R30,INDEX('Time Units'!$B:$K,MATCH(Q30,'Time Units'!$D:$D,0),MATCH(M30,'Time Units'!$B$2:$K$2,0)),0))","v":0},0,"rent2_TU == 0",{"$f":"IF(N30=\"\",\"\",CONCATENATE(\"replace \",O30,\"_\",Cover!$C$14,\" = \",P30,\" if \",U30))","v":"replace rent2_TU_1968 = 1 if rent2_TU == 0"},{"$f":"IF(N30=\"\",\"\",CONCATENATE(LEFT(O30,LEN(O30)-3),\"_\",Cover!$C$14))","v":"rent2_1968"},"replace rent2_1968 = rent2_1968",0]
[null,null,null,null,null,null,"",null,28,"",null,4,"Inap","DOLLARS PER WHAT",{"$f":"IF(N31=\"\",\"\",OFFSET(Variables!$E$2,MATCH(N31,Variables!$H$3:$H$45,0),0))","v":"rent2_TU"},{"$f":"IF(N31=\"\",\"\",HLOOKUP(M31,'Time Units'!$E$2:$K$3,2,0))","v":0},{"$f":"IF(N31=\"\",\"\",IF(Cover!$C$14>1996,'Time Units'!$D$4,CONCATENATE(O31,\"_\",Cover!$C$14)))","v":"rent2_TU_1968"},false,{"$f":"IF(N31=\"\",\"\",IF(R31,INDEX('Time Units'!$B:$K,MATCH(Q31,'Time Units'!$D:$D,0),MATCH(M31,'Time Units'!$B$2:$K$2,0)),0))","v":0},0,"rent2_TU == 0",{"$f":"IF(N31=\"\",\"\",CONCATENATE(\"replace \",O31,\"_\",Cover!$C$14,\" = \",P31,\" if \",U31))","v":"replace rent2_TU_1968 = 0 if rent2_TU == 0"},{"$f":"IF(N31=\"\",\"\",CONCATENATE(LEFT(O31,LEN(O31)-3),\"_\",Cover!$C$14))","v":"rent2_1968"},"replace rent2_1968 = rent2_1968",0]
[null,null,null,null,null,null,"",null,29,"",null,5,"Hour","TIME UNIT-HD RPRTD UNEMPL COMP",{"$f":"IF(N32=\"\",\"\",OFFSET(Variables!$E$2,MATCH(N32,Variables!$H$3:$H$45,0),0))","v":"unemp_inc4_TU"},{"$f":"IF(N32=\"\",\"\",HLOOKUP(M32,'Time Units'!$E$2:$K$3,2,0))","v":"."},{"$f":"IF(N32=\"\",\"\",IF(Cover!$C$14>1996,'Time Units'!$D$4,CONCATENATE(O32,\"_\",Cover!$C$14)))","v":"unemp_inc4_TU_1968"},false,{"$f":"IF(N32=\"\",\"\",IF(R32,INDEX('Time Units'!$B:$K,MATCH(Q32,'Time Units'!$D:$D,0),MATCH(M32,'Time Units'!$B$2:$K$2,0)),0))","v":0},0,"unemp_inc4_TU == 0",{"$f":"IF(N32=\"\",\"\",CONCATENATE(\"replace \",O32,\"_\",Cover!$C$14,\" = \",P32,\" if \",U32))","v":"replace unemp_inc4_TU_1968 = . if unemp_inc4_TU == 0"},{"$f":"IF(N32=\"\",\"\",CONCATENATE(LEFT(O32,LEN(O32)-3),\"_\",Cover!$C$14))","v":"unemp_inc4_1968"},"replace unemp_inc4_1968 = unemp_inc4_1968",0]
[null,null,null,null,null,null,"",null,30,"",null,5,"Day","TIME UNIT-HD RPRTD UNEMPL COMP",{"$f":"IF(N33=\"\",\"\",OFFSET(Variables!$E$2,MATCH(N33,Variables!$H$3:$H$45,0),0))","v":"unemp_inc4_TU"},{"$f":"IF(N33=\"\",\"\",HLOOKUP(M33,'Time Units'!$E$2:$K$3,2,0))","v":"."},{"$f":"IF(N33=\"\",\"\",IF(Cover!$C$14>1996,'Time Units'!$D$4,CONCATENATE(O33,\"_\",Cover!$C$14)))","v":"unemp_inc4_TU_1968"},false,{"$f":"IF(N33=\"\",\"\",IF(R33,INDEX('Time Units'!$B:$K,MATCH(Q33,'Time Units'!$D:$D,0),MATCH(M33,'Time Units'!$B$2:$K$2,0)),0))","v":0},0,"unemp_inc4_TU == 0",{"$f":"IF(N33=\"\",\"\",CONCATENATE(\"replace \",O33,\"_\",Cover!$C$14,\" = \",P33,\" if \",U33))","v":"replace unemp_inc4_TU_1968 = . if unemp_inc4_TU == 0"},{"$f":"IF(N33=\"\",\"\",CONCATENATE(LEFT(O33,LEN(O33)-3),\"_\",Cover!$C$14))","v":"unemp_inc4_1968"},"replace unemp_inc4_1968 = unemp_inc4_1968",0]
[null,null,null,null,null,null,"",null,31,"",null,5,"Week","TIME UNIT-HD RPRTD UNEMPL COMP",{"$f":"IF(N34=\"\",\"\",OFFSET(Variables!$E$2,MATCH(N34,Variables!$H$3:$H$45,0),0))","v":"unemp_inc4_TU"},{"$f":"IF(N34=\"\",\"\",HLOOKUP(M34,'Time Units'!$E$2:$K$3,2,0))","v":"."},{"$f":"IF(N34=\"\",\"\",IF(Cover!$C$14>1996,'Time Units'!$D$4,CONCATENATE(O34,\"_\",Cover!$C$14)))","v":"unemp_inc4_TU_1968"},false,{"$f":"IF(N34=\"\",\"\",IF(R34,INDEX('Time Units'!$B:$K,MATCH(Q34,'Time Units'!$D:$D,0),MATCH(M34,'Time Units'!$B$2:$K$2,0)),0))","v":0},0,"unemp_inc4_TU == 0",{"$f":"IF(N34=\"\",\"\",CONCATENATE(\"replace \",O34,\"_\",Cover!$C$14,\" = \",P34,\" if \",U34))","v":"replace unemp_inc4_TU_1968 = . if unemp_inc4_TU == 0"},{"$f":"IF(N34=\"\",\"\",CONCATENATE(LEFT(O34,LEN(O34)-3),\"_\",Cover!$C$14))","v":"unemp_inc4_1968"},"replace unemp_inc4_1968 = unemp_inc4_1968",0]
[null,null,null,null,null,null,"",null,32,"",null,5,"2 Wks","TIME UNIT-HD RPRTD UNEMPL COMP",{"$f":"IF(N35=\"\",\"\",OFFSET(Variables!$E$2,MATCH(N35,Variables!$H$3:$H$45,0),0))","v":"unemp_inc4_TU"},{"$f":"IF(N35=\"\",\"\",HLOOKUP(M35,'Time Units'!$E$2:$K$3,2,0))","v":26},{"$f":"IF(N35=\"\",\"\",IF(Cover!$C$14>1996,'Time Units'!$D$4,CONCATENATE(O35,\"_\",Cover!$C$14)))","v":"unemp_inc4_TU_1968"},false,{"$f":"IF(N35=\"\",\"\",IF(R35,INDEX('Time Units'!$B:$K,MATCH(Q35,'Time Units'!$D:$D,0),MATCH(M35,'Time Units'!$B$2:$K$2,0)),0))","v":0},0,"unemp_inc4_TU == 0",{"$f":"IF(N35=\"\",\"\",CONCATENATE(\"replace \",O35,\"_\",Cover!$C$14,\" = \",P35,\" if \",U35))","v":"replace unemp_inc4_TU_1968 = 26 if unemp_inc4_TU == 0"},{"$f":"IF(N35=\"\",\"\",CONCATENATE(LEFT(O35,LEN(O35)-3),\"_\",Cover!$C$14))","v":"unemp_inc4_1968"},"replace unemp_inc4_1968 = unemp_inc4_1968",0]
[null,null,null,null,null,null,"",null,33,{"$f":"IFERROR(OFFSET($V$3,MATCH(I36,$Y$4:$Y$45,0),0),\"\")","v":""},null,5,"Month","TIME UNIT-HD RPRTD UNEMPL COMP",{"$f":"IF(N36=\"\",\"\",OFFSET(Variables!$E$2,MATCH(N36,Variables!$H$3:$H$45,0),0))","v":"unemp_inc4_TU"},{"$f":"IF(N36=\"\",\"\",HLOOKUP(M36,'Time Units'!$E$2:$K$3,2,0))","v":12},{"$f":"IF(N36=\"\",\"\",IF(Cover!$C$14>1996,'Time Units'!$D$4,CONCATENATE(O36,\"_\",Cover!$C$14)))","v":"unemp_inc4_TU_1968"},false,{"$f":"IF(N36=\"\",\"\",IF(R36,INDEX('Time Units'!$B:$K,MATCH(Q36,'Time Units'!$D:$D,0),MATCH(M36,'Time Units'!$B$2:$K$2,0)),0))","v":0},0,"unemp_inc4_TU == 0",{"$f":"IF(N36=\"\",\"\",CONCATENATE(\"replace \",O36,\"_\",Cover!$C$14,\" = \",P36,\" if \",U36))","v":"replace unemp_inc4_TU_1968 = 12 if unemp_inc4_TU == 0"},{"$f":"IF(N36=\"\",\"\",CONCATENATE(LEFT(O36,LEN(O36)-3),\"_\",Cover!$C$14))","v":"unemp_inc4_1968"},"replace unemp_inc4_1968 = unemp_inc4_1968",{"$f":"IF(N36=\"\",\"\",IF(S36>0,IF(ISNUMBER(Y35),Y35+1,1),IF(ISNUMBER(Y35),Y35,0)))","v":0}]
[null,null,null,null,null,null,"",null,34,"",null,5,"Year","TIME UNIT-HD RPRTD UNEMPL COMP",{"$f":"IF(N37=\"\",\"\",OFFSET(Variables!$E$2,MATCH(N37,Variables!$H$3:$H$45,0),0))","v":"unemp_inc4_TU"},{"$f":"IF(N37=\"\",\"\",HLOOKUP(M37,'Time Units'!$E$2:$K$3,2,0))","v":1},{"$f":"IF(N37=\"\",\"\",IF(Cover!$C$14>1996,'Time Units'!$D$4,CONCATENATE(O37,\"_\",Cover!$C$14)))","v":"unemp_inc4_TU_1968"},false,{"$f":"IF(N37=\"\",\"\",IF(R37,INDEX('Time Units'!$B:$K,MATCH(Q37,'Time Units'!$D:$D,0),MATCH(M37,'Time Units'!$B$2:$K$2,0)),0))","v":0},0,"unemp_inc4_TU == 0",{"$f":"IF(N37=\"\",\"\",CONCATENATE(\"replace \",O37,\"_\",Cover!$C$14,\" = \",P37,\" if \",U37))","v":"replace unemp_inc4_TU_1968 = 1 if unemp_inc4_TU == 0"},{"$f":"IF(N37=\"\",\"\",CONCATENATE(LEFT(O37,LEN(O37)-3),\"_\",Cover!$C$14))","v":"unemp_inc4_1968"},"replace unemp_inc4_1968 = unemp_inc4_1968",0]
[null,null,null,null,null,null,"",null,35,"",null,5,"Inap","TIME UNIT-HD RPRTD UNEMPL COMP",{"$f":"IF(N38=\"\",\"\",OFFSET(Variables!$E$2,MATCH(N38,Variables!$H$3:$H$45,0),0))","v":"unemp_inc4_TU"},{"$f":"IF(N38=\"\",\"\",HLOOKUP(M38,'Time Units'!$E$2:$K$3,2,0))","v":0},{"$f":"IF(N38=\"\",\"\",IF(Cover!$C$14>1996,'Time Units'!$D$4,CONCATENATE(O38,\"_\",Cover!$C$14)))","v":"unemp_inc4_TU_1968"},false,{"$f":"IF(N38=\"\",\"\",IF(R38,INDEX('Time Units'!$B:$K,MATCH(Q38,'Time Units'!$D:$D,0),MATCH(M38,'Time Units'!$B$2:$K$2,0)),0))","v":0},0,"unemp_inc4_TU == 0",{"$f":"IF(N38=\"\",\"\",CONCATENATE(\"replace \",O38,\"_\",Cover!$C$14,\" = \",P38,\" if \",U38))","v":"replace unemp_inc4_TU_1968 = 0 if unemp_inc4_TU == 0"},{"$f":"IF(N38=\"\",\"\",CONCATENATE(LEFT(O38,LEN(O38)-3),\"_\",Cover!$C$14))","v":"unemp_inc4_1968"},"replace unemp_inc4_1968 = unemp_inc4_1968",0]
[null,null,null,null,null,null,"",null,36,"",null,6,"Hour","TIME UNIT-WF REPORTED UNEMP COMP",{"$f":"IF(N39=\"\",\"\",OFFSET(Variables!$E$2,MATCH(N39,Variables!$H$3:$H$45,0),0))","v":"unemp_inc6_TU"},{"$f":"IF(N39=\"\",\"\",HLOOKUP(M39,'Time Units'!$E$2:$K$3,2,0))","v":"."},{"$f":"IF(N39=\"\",\"\",IF(Cover!$C$14>1996,'Time Units'!$D$4,CONCATENATE(O39,\"_\",Cover!$C$14)))","v":"unemp_inc6_TU_1968"},false,{"$f":"IF(N39=\"\",\"\",IF(R39,INDEX('Time Units'!$B:$K,MATCH(Q39,'Time Units'!$D:$D,0),MATCH(M39,'Time Units'!$B$2:$K$2,0)),0))","v":0},0,"unemp_inc6_TU == 0",{"$f":"IF(N39=\"\",\"\",CONCATENATE(\"replace \",O39,\"_\",Cover!$C$14,\" = \",P39,\" if \",U39))","v":"replace unemp_inc6_TU_1968 = . if unemp_inc6_TU == 0"},{"$f":"IF(N39=\"\",\"\",CONCATENATE(LEFT(O39,LEN(O39)-3),\"_\",Cover!$C$14))","v":"unemp_inc6_1968"},"replace unemp_inc6_1968 = unemp_inc6_1968",0]
[null,null,null,null,null,null,"",null,37,"",null,6,"Day","TIME UNIT-WF REPORTED UNEMP COMP",{"$f":"IF(N40=\"\",\"\",OFFSET(Variables!$E$2,MATCH(N40,Variables!$H$3:$H$45,0),0))","v":"unemp_inc6_TU"},{"$f":"IF(N40=\"\",\"\",HLOOKUP(M40,'Time Units'!$E$2:$K$3,2,0))","v":"."},{"$f":"IF(N40=\"\",\"\",IF(Cover!$C$14>1996,'Time Units'!$D$4,CONCATENATE(O40,\"_\",Cover!$C$14)))","v":"unemp_inc6_TU_1968"},false,{"$f":"IF(N40=\"\",\"\",IF(R40,INDEX('Time Units'!$B:$K,MATCH(Q40,'Time Units'!$D:$D,0),MATCH(M40,'Time Units'!$B$2:$K$2,0)),0))","v":0},0,"unemp_inc6_TU == 0",{"$f":"IF(N40=\"\",\"\",CONCATENATE(\"replace \",O40,\"_\",Cover!$C$14,\" = \",P40,\" if \",U40))","v":"replace unemp_inc6_TU_1968 = . if unemp_inc6_TU == 0"},{"$f":"IF(N40=\"\",\"\",CONCATENATE(LEFT(O40,LEN(O40)-3),\"_\",Cover!$C$14))","v":"unemp_inc6_1968"},"replace unemp_inc6_1968 = unemp_inc6_1968",0]
[null,null,null,null,null,null,"",null,38,"",null,6,"Week","TIME UNIT-WF REPORTED UNEMP COMP",{"$f":"IF(N41=\"\",\"\",OFFSET(Variables!$E$2,MATCH(N41,Variables!$H$3:$H$45,0),0))","v":"unemp_inc6_TU"},{"$f":"IF(N41=\"\",\"\",HLOOKUP(M41,'Time Units'!$E$2:$K$3,2,0))","v":"."},{"$f":"IF(N41=\"\",\"\",IF(Cover!$C$14>1996,'Time Units'!$D$4,CONCATENATE(O41,\"_\",Cover!$C$14)))","v":"unemp_inc6_TU_1968"},false,{"$f":"IF(N41=\"\",\"\",IF(R41,INDEX('Time Units'!$B:$K,MATCH(Q41,'Time Units'!$D:$D,0),MATCH(M41,'Time Units'!$B$2:$K$2,0)),0))","v":0},0,"unemp_inc6_TU == 0",{"$f":"IF(N41=\"\",\"\",CONCATENATE(\"replace \",O41,\"_\",Cover!$C$14,\" = \",P41,\" if \",U41))","v":"replace unemp_inc6_TU_1968 = . if unemp_inc6_TU == 0"},{"$f":"IF(N41=\"\",\"\",CONCATENATE(LEFT(O41,LEN(O41)-3),\"_\",Cover!$C$14))","v":"unemp_inc6_1968"},"replace unemp_inc6_1968 = unemp_inc6_1968",0]
[null,null,null,null,null,null,"",null,39,"",null,6,"2 Wks","TIME UNIT-WF REPORTED UNEMP COMP",{"$f":"IF(N42=\"\",\"\",OFFSET(Variables!$E$2,MATCH(N42,Variables!$H$3:$H$45,0),0))","v":"unemp_inc6_TU"},{"$f":"IF(N42=\"\",\"\",HLOOKUP(M42,'Time Units'!$E$2:$K$3,2,0))","v":26},{"$f":"IF(N42=\"\",\"\",IF(Cover!$C$14>1996,'Time Units'!$D$4,CONCATENATE(O42,\"_\",Cover!$C$14)))","v":"unemp_inc6_TU_1968"},false,{"$f":"IF(N42=\"\",\"\",IF(R42,INDEX('Time Units'!$B:$K,MATCH(Q42,'Time Units'!$D:$D,0),MATCH(M42,'Time Units'!$B$2:$K$2,0)),0))","v":0},0,"unemp_inc6_TU == 0",{"$f":"IF(N42=\"\",\"\",CONCATENATE(\"replace \",O42,\"_\",Cover!$C$14,\" = \",P42,\" if \",U42))","v":"replace unemp_inc6_TU_1968 = 26 if unemp_inc6_TU == 0"},{"$f":"IF(N42=\"\",\"\",CONCATENATE(LEFT(O42,LEN(O42)-3),\"_\",Cover!$C$14))","v":"unemp_inc6_1968"},"replace unemp_inc6_1968 = unemp_inc6_1968",0]
[null,null,null,null,null,null,"",null,40,"",null,{"$f":"L36+1","v":6},"Month","TIME UNIT-WF REPORTED UNEMP COMP",{"$f":"IF(N43=\"\",\"\",OFFSET(Variables!$E$2,MATCH(N43,Variables!$H$3:$H$45,0),0))","v":"unemp_inc6_TU"},{"$f":"IF(N43=\"\",\"\",HLOOKUP(M43,'Time Units'!$E$2:$K$3,2,0))","v":12},{"$f":"IF(N43=\"\",\"\",IF(Cover!$C$14>1996,'Time Units'!$D$4,CONCATENATE(O43,\"_\",Cover!$C$14)))","v":"unemp_inc6_TU_1968"},false,{"$f":"IF(N43=\"\",\"\",IF(R43,INDEX('Time Units'!$B:$K,MATCH(Q43,'Time Units'!$D:$D,0),MATCH(M43,'Time Units'!$B$2:$K$2,0)),0))","v":0},0,"unemp_inc6_TU == 0",{"$f":"IF(N43=\"\",\"\",CONCATENATE(\"replace \",O43,\"_\",Cover!$C$14,\" = \",P43,\" if \",U43))","v":"replace unemp_inc6_TU_1968 = 12 if unemp_inc6_TU == 0"},{"$f":"IF(N43=\"\",\"\",CONCATENATE(LEFT(O43,LEN(O43)-3),\"_\",Cover!$C$14))","v":"unemp_inc6_1968"},"replace unemp_inc6_1968 = unemp_inc6_1968",0]
[null,null,null,null,null,null,"",null,41,"",null,6,"Year","TIME UNIT-WF REPORTED UNEMP COMP",{"$f":"IF(N44=\"\",\"\",OFFSET(Variables!$E$2,MATCH(N44,Variables!$H$3:$H$45,0),0))","v":"unemp_inc6_TU"},{"$f":"IF(N44=\"\",\"\",HLOOKUP(M44,'Time Units'!$E$2:$K$3,2,0))","v":1},{"$f":"IF(N44=\"\",\"\",IF(Cover!$C$14>1996,'Time Units'!$D$4,CONCATENATE(O44,\"_\",Cover!$C$14)))","v":"unemp_inc6_TU_1968"},false,{"$f":"IF(N44=\"\",\"\",IF(R44,INDEX('Time Units'!$B:$K,MATCH(Q44,'Time Units'!$D:$D,0),MATCH(M44,'Time Units'!$B$2:$K$2,0)),0))","v":0},0,"unemp_inc6_TU == 0",{"$f":"IF(N44=\"\",\"\",CONCATENATE(\"replace \",O44,\"_\",Cover!$C$14,\" = \",P44,\" if \",U44))","v":"replace unemp_inc6_TU_1968 = 1 if unemp_inc6_TU == 0"},{"$f":"IF(N44=\"\",\"\",CONCATENATE(LEFT(O44,LEN(O44)-3),\"_\",Cover!$C$14))","v":"unemp_inc6_1968"},"replace unemp_inc6_1968 = unemp_inc6_1968",0]
[null,null,null,null,null,null,"",null,42,"",null,6,"Inap","TIME UNIT-WF REPORTED UNEMP COMP",{"$f":"IF(N45=\"\",\"\",OFFSET(Variables!$E$2,MATCH(N45,Variables!$H$3:$H$45,0),0))","v":"unemp_inc6_TU"},{"$f":"IF(N45=\"\",\"\",HLOOKUP(M45,'Time Units'!$E$2:$K$3,2,0))","v":0},{"$f":"IF(N45=\"\",\"\",IF(Cover!$C$14>1996,'Time Units'!$D$4,CONCATENATE(O45,\"_\",Cover!$C$14)))","v":"unemp_inc6_TU_1968"},false,{"$f":"IF(N45=\"\",\"\",IF(R45,INDEX('Time Units'!$B:$K,MATCH(Q45,'Time Units'!$D:$D,0),MATCH(M45,'Time Units'!$B$2:$K$2,0)),0))","v":0},0,"unemp_inc6_TU == 0",{"$f":"IF(N45=\"\",\"\",CONCATENATE(\"replace \",O45,\"_\",Cover!$C$14,\" = \",P45,\" if \",U45))","v":"replace unemp_inc6_TU_1968 = 0 if unemp_inc6_TU == 0"},{"$f":"IF(N45=\"\",\"\",CONCATENATE(LEFT(O45,LEN(O45)-3),\"_\",Cover!$C$14))","v":"unemp_inc6_1968"},"replace unemp_inc6_1968 = unemp_inc6_1968",0]
[null,null,null,null,null,null,"",null,43,"",null,7,"Hour","",{"$f":"IF(N46=\"\",\"\",OFFSET(Variables!$E$2,MATCH(N46,Variables!$H$3:$H$45,0),0))","v":""},{"$f":"IF(N46=\"\",\"\",HLOOKUP(M46,'Time Units'!$E$2:$K$3,2,0))","v":""},{"$f":"IF(N46=\"\",\"\",IF(Cover!$C$14>1996,'Time Units'!$D$4,CONCATENATE(O46,\"_\",Cover!$C$14)))","v":""},"",{"$f":"IF(N46=\"\",\"\",IF(R46,INDEX('Time Units'!$B:$K,MATCH(Q46,'Time Units'!$D:$D,0),MATCH(M46,'Time Units'!$B$2:$K$2,0)),0))","v":""},"","",{"$f":"IF(N46=\"\",\"\",CONCATENATE(\"replace \",O46,\"_\",Cover!$C$14,\" = \",P46,\" if \",U46))","v":""},{"$f":"IF(N46=\"\",\"\",CONCATENATE(LEFT(O46,LEN(O46)-3),\"_\",Cover!$C$14))","v":""},"",""]
[null,null,null,null,null,null,"",null,44,"",null,7,"Day","",{"$f":"IF(N47=\"\",\"\",OFFSET(Variables!$E$2,MATCH(N47,Variables!$H$3:$H$45,0),0))","v":""},{"$f":"IF(N47=\"\",\"\",HLOOKUP(M47,'Time Units'!$E$2:$K$3,2,0))","v":""},{"$f":"IF(N47=\"\",\"\",IF(Cover!$C$14>1996,'Time Units'!$D$4,CONCATENATE(O47,\"_\",Cover!$C$14)))","v":""},"",{"$f":"IF(N47=\"\",\"\",IF(R47,INDEX('Time Units'!$B:$K,MATCH(Q47,'Time Units'!$D:$D,0),MATCH(M47,'Time Units'!$B$2:$K$2,0)),0))","v":""},"","",{"$f":"IF(N47=\"\",\"\",CONCATENATE(\"replace \",O47,\"_\",Cover!$C$14,\" = \",P47,\" if \",U47))","v":""},{"$f":"IF(N47=\"\",\"\",CONCATENATE(LEFT(O47,LEN(O47)-3),\"_\",Cover!$C$14))","v":""},"",""]
[null,null,null,null,null,null,"",null,45,"",null,7,"Week","",{"$f":"IF(N48=\"\",\"\",OFFSET(Variables!$E$2,MATCH(N48,Variables!$H$3:$H$45,0),0))","v":""},{"$f":"IF(N48=\"\",\"\",HLOOKUP(M48,'Time Units'!$E$2:$K$3,2,0))","v":""},{"$f":"IF(N48=\"\",\"\",IF(Cover!$C$14>1996,'Time Units'!$D$4,CONCATENATE(O48,\"_\",Cover!$C$14)))","v":""},"",{"$f":"IF(N48=\"\",\"\",IF(R48,INDEX('Time Units'!$B:$K,MATCH(Q48,'Time Units'!$D:$D,0),MATCH(M48,'Time Units'!$B$2:$K$2,0)),0))","v":""},"","",{"$f":"IF(N48=\"\",\"\",CONCATENATE(\"replace \",O48,\"_\",Cover!$C$14,\" = \",P48,\" if \",U48))","v":""},{"$f":"IF(N48=\"\",\"\",CONCATENATE(LEFT(O48,LEN(O48)-3),\"_\",Cover!$C$14))","v":""},"",""]
[null,null,null,null,null,null,"",null,46,"",null,7,"2 Wks","",{"$f":"IF(N49=\"\",\"\",OFFSET(Variables!$E$2,MATCH(N49,Variables!$H$3:$H$45,0),0))","v":""},{"$f":"IF(N49=\"\",\"\",HLOOKUP(M49,'Time Units'!$E$2:$K$3,2,0))","v":""},{"$f":"IF(N49=\"\",\"\",IF(Cover!$C$14>1996,'Time Units'!$D$4,CONCATENATE(O49,\"_\",Cover!$C$14)))","v":""},"",{"$f":"IF(N49=\"\",\"\",IF(R49,INDEX('Time Units'!$B:$K,MATCH(Q49,'Time Units'!$D:$D,0),MATCH(M49,'Time Units'!$B$2:$K$2,0)),0))","v":""},"","",{"$f":"IF(N49=\"\",\"\",CONCATENATE(\"replace \",O49,\"_\",Cover!$C$14,\" = \",P49,\" if \",U49))","v":""},{"$f":"IF(N49=\"\",\"\",CONCATENATE(LEFT(O49,LEN(O49)-3),\"_\",Cover!$C$14))","v":""},"",""]
[null,null,null,null,null,null,"",null,47,"",null,7,"Month","",{"$f":"IF(N50=\"\",\"\",OFFSET(Variables!$E$2,MATCH(N50,Variables!$H$3:$H$45,0),0))","v":""},{"$f":"IF(N50=\"\",\"\",HLOOKUP(M50,'Time Units'!$E$2:$K$3,2,0))","v":""},{"$f":"IF(N50=\"\",\"\",IF(Cover!$C$14>1996,'Time Units'!$D$4,CONCATENATE(O50,\"_\",Cover!$C$14)))","v":""},"",{"$f":"IF(N50=\"\",\"\",IF(R50,INDEX('Time Units'!$B:$K,MATCH(Q50,'Time Units'!$D:$D,0),MATCH(M50,'Time Units'!$B$2:$K$2,0)),0))","v":""},"","",{"$f":"IF(N50=\"\",\"\",CONCATENATE(\"replace \",O50,\"_\",Cover!$C$14,\" = \",P50,\" if \",U50))","v":""},{"$f":"IF(N50=\"\",\"\",CONCATENATE(LEFT(O50,LEN(O50)-3),\"_\",Cover!$C$14))","v":""},"",""]
[null,null,null,null,null,null,"",null,48,"",null,7,"Year","",{"$f":"IF(N51=\"\",\"\",OFFSET(Variables!$E$2,MATCH(N51,Variables!$H$3:$H$45,0),0))","v":""},{"$f":"IF(N51=\"\",\"\",HLOOKUP(M51,'Time Units'!$E$2:$K$3,2,0))","v":""},{"$f":"IF(N51=\"\",\"\",IF(Cover!$C$14>1996,'Time Units'!$D$4,CONCATENATE(O51,\"_\",Cover!$C$14)))","v":""},"",{"$f":"IF(N51=\"\",\"\",IF(R51,INDEX('Time Units'!$B:$K,MATCH(Q51,'Time Units'!$D:$D,0),MATCH(M51,'Time Units'!$B$2:$K$2,0)),0))","v":""},"","",{"$f":"IF(N51=\"\",\"\",CONCATENATE(\"replace \",O51,\"_\",Cover!$C$14,\" = \",P51,\" if \",U51))","v":""},{"$f":"IF(N51=\"\",\"\",CONCATENATE(LEFT(O51,LEN(O51)-3),\"_\",Cover!$C$14))","v":""},"",""]
[null,null,null,null,null,null,"",null,49,"",null,7,"Inap","",{"$f":"IF(N52=\"\",\"\",OFFSET(Variables!$E$2,MATCH(N52,Variables!$H$3:$H$45,0),0))","v":""},{"$f":"IF(N52=\"\",\"\",HLOOKUP(M52,'Time Units'!$E$2:$K$3,2,0))","v":""},{"$f":"IF(N52=\"\",\"\",IF(Cover!$C$14>1996,'Time Units'!$D$4,CONCATENATE(O52,\"_\",Cover!$C$14)))","v":""},"",{"$f":"IF(N52=\"\",\"\",IF(R52,INDEX('Time Units'!$B:$K,MATCH(Q52,'Time Units'!$D:$D,0),MATCH(M52,'Time Units'!$B$2:$K$2,0)),0))","v":""},"","",{"$f":"IF(N52=\"\",\"\",CONCATENATE(\"replace \",O52,\"_\",Cover!$C$14,\" = \",P52,\" if \",U52))","v":""},{"$f":"IF(N52=\"\",\"\",CONCATENATE(LEFT(O52,LEN(O52)-3),\"_\",Cover!$C$14))","v":""},"",""]
[null,null,null,null,null,null,"",null,50,"",null,8,"Hour","",{"$f":"IF(N53=\"\",\"\",OFFSET(Variables!$E$2,MATCH(N53,Variables!$H$3:$H$45,0),0))","v":""},{"$f":"IF(N53=\"\",\"\",HLOOKUP(M53,'Time Units'!$E$2:$K$3,2,0))","v":""},{"$f":"IF(N53=\"\",\"\",IF(Cover!$C$14>1996,'Time Units'!$D$4,CONCATENATE(O53,\"_\",Cover!$C$14)))","v":""},"",{"$f":"IF(N53=\"\",\"\",IF(R53,INDEX('Time Units'!$B:$K,MATCH(Q53,'Time Units'!$D:$D,0),MATCH(M53,'Time Units'!$B$2:$K$2,0)),0))","v":""},"","",{"$f":"IF(N53=\"\",\"\",CONCATENATE(\"replace \",O53,\"_\",Cover!$C$14,\" = \",P53,\" if \",U53))","v":""},{"$f":"IF(N53=\"\",\"\",CONCATENATE(LEFT(O53,LEN(O53)-3),\"_\",Cover!$C$14))","v":""},"",""]
[null,null,null,null,null,null,null,null,null,null,null,8,"Day","",{"$f":"IF(N54=\"\",\"\",OFFSET(Variables!$E$2,MATCH(N54,Variables!$H$3:$H$45,0),0))","v":""},{"$f":"IF(N54=\"\",\"\",HLOOKUP(M54,'Time Units'!$E$2:$K$3,2,0))","v":""},{"$f":"IF(N54=\"\",\"\",IF(Cover!$C$14>1996,'Time Units'!$D$4,CONCATENATE(O54,\"_\",Cover!$C$14)))","v":""},"",{"$f":"IF(N54=\"\",\"\",IF(R54,INDEX('Time Units'!$B:$K,MATCH(Q54,'Time Units'!$D:$D,0),MATCH(M54,'Time Units'!$B$2:$K$2,0)),0))","v":""},"","",{"$f":"IF(N54=\"\",\"\",CONCATENATE(\"replace \",O54,\"_\",Cover!$C$14,\" = \",P54,\" if \",U54))","v":""},{"$f":"IF(N54=\"\",\"\",CONCATENATE(LEFT(O54,LEN(O54)-3),\"_\",Cover!$C$14))","v":""},"",""]
[null,null,null,null,null,null,null,null,null,null,null,8,"Week","",{"$f":"IF(N55=\"\",\"\",OFFSET(Variables!$E$2,MATCH(N55,Variables!$H$3:$H$45,0),0))","v":""},{"$f":"IF(N55=\"\",\"\",HLOOKUP(M55,'Time Units'!$E$2:$K$3,2,0))","v":""},{"$f":"IF(N55=\"\",\"\",IF(Cover!$C$14>1996,'Time Units'!$D$4,CONCATENATE(O55,\"_\",Cover!$C$14)))","v":""},"",{"$f":"IF(N55=\"\",\"\",IF(R55,INDEX('Time Units'!$B:$K,MATCH(Q55,'Time Units'!$D:$D,0),MATCH(M55,'Time Units'!$B$2:$K$2,0)),0))","v":""},"","",{"$f":"IF(N55=\"\",\"\",CONCATENATE(\"replace \",O55,\"_\",Cover!$C$14,\" = \",P55,\" if \",U55))","v":""},{"$f":"IF(N55=\"\",\"\",CONCATENATE(LEFT(O55,LEN(O55)-3),\"_\",Cover!$C$14))","v":""},"",""]
[null,null,null,null,null,null,null,null,null,null,null,8,"2 Wks","",{"$f":"IF(N56=\"\",\"\",OFFSET(Variables!$E$2,MATCH(N56,Variables!$H$3:$H$45,0),0))","v":""},{"$f":"IF(N56=\"\",\"\",HLOOKUP(M56,'Time Units'!$E$2:$K$3,2,0))","v":""},{"$f":"IF(N56=\"\",\"\",IF(Cover!$C$14>1996,'Time Units'!$D$4,CONCATENATE(O56,\"_\",Cover!$C$14)))","v":""},"",{"$f":"IF(N56=\"\",\"\",IF(R56,INDEX('Time Units'!$B:$K,MATCH(Q56,'Time Units'!$D:$D,0),MATCH(M56,'Time Units'!$B$2:$K$2,0)),0))","v":""},"","",{"$f":"IF(N56=\"\",\"\",CONCATENATE(\"replace \",O56,\"_\",Cover!$C$14,\" = \",P56,\" if \",U56))","v":""},{"$f":"IF(N56=\"\",\"\",CONCATENATE(LEFT(O56,LEN(O56)-3),\"_\",Cover!$C$14))","v":""},"",""]
[null,null,null,null,null,null,null,null,null,null,null,8,"Month","",{"$f":"IF(N57=\"\",\"\",OFFSET(Variables!$E$2,MATCH(N57,Variables!$H$3:$H$45,0),0))","v":""},{"$f":"IF(N57=\"\",\"\",HLOOKUP(M57,'Time Units'!$E$2:$K$3,2,0))","v":""},{"$f":"IF(N57=\"\",\"\",IF(Cover!$C$14>1996,'Time Units'!$D$4,CONCATENATE(O57,\"_\",Cover!$C$14)))","v":""},"",{"$f":"IF(N57=\"\",\"\",IF(R57,INDEX('Time Units'!$B:$K,MATCH(Q57,'Time Units'!$D:$D,0),MATCH(M57,'Time Units'!$B$2:$K$2,0)),0))","v":""},"","",{"$f":"IF(N57=\"\",\"\",CONCATENATE(\"replace \",O57,\"_\",Cover!$C$14,\" = \",P57,\" if \",U57))","v":""},{"$f":"IF(N57=\"\",\"\",CONCATENATE(LEFT(O57,LEN(O57)-3),\"_\",Cover!$C$14))","v":""},"",""]
[null,null,null,null,null,null,null,null,null,null,null,8,"Year","",{"$f":"IF(N58=\"\",\"\",OFFSET(Variables!$E$2,MATCH(N58,Variables!$H$3:$H$45,0),0))","v":""},{"$f":"IF(N58=\"\",\"\",HLOOKUP(M58,'Time Units'!$E$2:$K$3,2,0))","v":""},{"$f":"IF(N58=\"\",\"\",IF(Cover!$C$14>1996,'Time Units'!$D$4,CONCATENATE(O58,\"_\",Cover!$C$14)))","v":""},"",{"$f":"IF(N58=\"\",\"\",IF(R58,INDEX('Time Units'!$B:$K,MATCH(Q58,'Time Units'!$D:$D,0),MATCH(M58,'Time Units'!$B$2:$K$2,0)),0))","v":""},"","",{"$f":"IF(N58=\"\",\"\",CONCATENATE(\"replace \",O58,\"_\",Cover!$C$14,\" = \",P58,\" if \",U58))","v":""},{"$f":"IF(N58=\"\",\"\",CONCATENATE(LEFT(O58,LEN(O58)-3),\"_\",Cover!$C$14))","v":""},"",""]
[null,null,null,null,null,null,null,null,null,null,null,8,"Inap","",{"$f":"IF(N59=\"\",\"\",OFFSET(Variables!$E$2,MATCH(N59,Variables!$H$3:$H$45,0),0))","v":""},{"$f":"IF(N59=\"\",\"\",HLOOKUP(M59,'Time Units'!$E$2:$K$3,2,0))","v":""},{"$f":"IF(N59=\"\",\"\",IF(Cover!$C$14>1996,'Time Units'!$D$4,CONCATENATE(O59,\"_\",Cover!$C$14)))","v":""},"",{"$f":"IF(N59=\"\",\"\",IF(R59,INDEX('Time Units'!$B:$K,MATCH(Q59,'Time Units'!$D:$D,0),MATCH(M59,'Time Units'!$B$2:$K$2,0)),0))","v":""},"","",{"$f":"IF(N59=\"\",\"\",CONCATENATE(\"replace \",O59,\"_\",Cover!$C$14,\" = \",P59,\" if \",U59))","v":""},{"$f":"IF(N59=\"\",\"\",CONCATENATE(LEFT(O59,LEN(O59)-3),\"_\",Cover!$C$14))","v":""},"",""]
[null,null,null,null,null,null,null,null,null,null,null,9,"Hour","",{"$f":"IF(N60=\"\",\"\",OFFSET(Variables!$E$2,MATCH(N60,Variables!$H$3:$H$45,0),0))","v":""},{"$f":"IF(N60=\"\",\"\",HLOOKUP(M60,'Time Units'!$E$2:$K$3,2,0))","v":""},{"$f":"IF(N60=\"\",\"\",IF(Cover!$C$14>1996,'Time Units'!$D$4,CONCATENATE(O60,\"_\",Cover!$C$14)))","v":""},"",{"$f":"IF(N60=\"\",\"\",IF(R60,INDEX('Time Units'!$B:$K,MATCH(Q60,'Time Units'!$D:$D,0),MATCH(M60,'Time Units'!$B$2:$K$2,0)),0))","v":""},"","",{"$f":"IF(N60=\"\",\"\",CONCATENATE(\"replace \",O60,\"_\",Cover!$C$14,\" = \",P60,\" if \",U60))","v":""},{"$f":"IF(N60=\"\",\"\",CONCATENATE(LEFT(O60,LEN(O60)-3),\"_\",Cover!$C$14))","v":""},"",""]
[null,null,null,null,null,null,null,null,null,null,null,9,"Day","",{"$f":"IF(N61=\"\",\"\",OFFSET(Variables!$E$2,MATCH(N61,Variables!$H$3:$H$45,0),0))","v":""},{"$f":"IF(N61=\"\",\"\",HLOOKUP(M61,'Time Units'!$E$2:$K$3,2,0))","v":""},{"$f":"IF(N61=\"\",\"\",IF(Cover!$C$14>1996,'Time Units'!$D$4,CONCATENATE(O61,\"_\",Cover!$C$14)))","v":""},"",{"$f":"IF(N61=\"\",\"\",IF(R61,INDEX('Time Units'!$B:$K,MATCH(Q61,'Time Units'!$D:$D,0),MATCH(M61,'Time Units'!$B$2:$K$2,0)),0))","v":""},"","",{"$f":"IF(N61=\"\",\"\",CONCATENATE(\"replace \",O61,\"_\",Cover!$C$14,\" = \",P61,\" if \",U61))","v":""},{"$f":"IF(N61=\"\",\"\",CONCATENATE(LEFT(O61,LEN(O61)-3),\"_\",Cover!$C$14))","v":""},"",""]
[null,null,null,null,null,null,null,null,null,null,null,9,"Week","",{"$f":"IF(N62=\"\",\"\",OFFSET(Variables!$E$2,MATCH(N62,Variables!$H$3:$H$45,0),0))","v":""},{"$f":"IF(N62=\"\",\"\",HLOOKUP(M62,'Time Units'!$E$2:$K$3,2,0))","v":""},{"$f":"IF(N62=\"\",\"\",IF(Cover!$C$14>1996,'Time Units'!$D$4,CONCATENATE(O62,\"_\",Cover!$C$14)))","v":""},"",{"$f":"IF(N62=\"\",\"\",IF(R62,INDEX('Time Units'!$B:$K,MATCH(Q62,'Time Units'!$D:$D,0),MATCH(M62,'Time Units'!$B$2:$K$2,0)),0))","v":""},"","",{"$f":"IF(N62=\"\",\"\",CONCATENATE(\"replace \",O62,\"_\",Cover!$C$14,\" = \",P62,\" if \",U62))","v":""},{"$f":"IF(N62=\"\",\"\",CONCATENATE(LEFT(O62,LEN(O62)-3),\"_\",Cover!$C$14))","v":""},"",""]
[null,null,null,null,null,null,null,null,null,null,null,9,"2 Wks","",{"$f":"IF(N63=\"\",\"\",OFFSET(Variables!$E$2,MATCH(N63,Variables!$H$3:$H$45,0),0))","v":""},{"$f":"IF(N63=\"\",\"\",HLOOKUP(M63,'Time Units'!$E$2:$K$3,2,0))","v":""},{"$f":"IF(N63=\"\",\"\",IF(Cover!$C$14>1996,'Time Units'!$D$4,CONCATENATE(O63,\"_\",Cover!$C$14)))","v":""},"",{"$f":"IF(N63=\"\",\"\",IF(R63,INDEX('Time Units'!$B:$K,MATCH(Q63,'Time Units'!$D:$D,0),MATCH(M63,'Time Units'!$B$2:$K$2,0)),0))","v":""},"","",{"$f":"IF(N63=\"\",\"\",CONCATENATE(\"replace \",O63,\"_\",Cover!$C$14,\" = \",P63,\" if \",U63))","v":""},{"$f":"IF(N63=\"\",\"\",CONCATENATE(LEFT(O63,LEN(O63)-3),\"_\",Cover!$C$14))","v":""},"",""]
[null,null,null,null,null,null,null,null,null,null,null,9,"Month","",{"$f":"IF(N64=\"\",\"\",OFFSET(Variables!$E$2,MATCH(N64,Variables!$H$3:$H$45,0),0))","v":""},{"$f":"IF(N64=\"\",\"\",HLOOKUP(M64,'Time Units'!$E$2:$K$3,2,0))","v":""},{"$f":"IF(N64=\"\",\"\",IF(Cover!$C$14>1996,'Time Units'!$D$4,CONCATENATE(O64,\"_\",Cover!$C$14)))","v":""},"",{"$f":"IF(N64=\"\",\"\",IF(R64,INDEX('Time Units'!$B:$K,MATCH(Q64,'Time Units'!$D:$D,0),MATCH(M64,'Time Units'!$B$2:$K$2,0)),0))","v":""},"","",{"$f":"IF(N64=\"\",\"\",CONCATENATE(\"replace \",O64,\"_\",Cover!$C$14,\" = \",P64,\" if \",U64))","v":""},{"$f":"IF(N64=\"\",\"\",CONCATENATE(LEFT(O64,LEN(O64)-3),\"_\",Cover!$C$14))","v":""},"",""]
[null,null,null,null,null,null,null,null,null,null,null,9,"Year","",{"$f":"IF(N65=\"\",\"\",OFFSET(Variables!$E$2,MATCH(N65,Variables!$H$3:$H$45,0),0))","v":""},{"$f":"IF(N65=\"\",\"\",HLOOKUP(M65,'Time Units'!$E$2:$K$3,2,0))","v":""},{"$f":"IF(N65=\"\",\"\",IF(Cover!$C$14>1996,'Time Units'!$D$4,CONCATENATE(O65,\"_\",Cover!$C$14)))","v":""},"",{"$f":"IF(N65=\"\",\"\",IF(R65,INDEX('Time Units'!$B:$K,MATCH(Q65,'Time Units'!$D:$D,0),MATCH(M65,'Time Units'!$B$2:$K$2,0)),0))","v":""},"","",{"$f":"IF(N65=\"\",\"\",CONCATENATE(\"replace \",O65,\"_\",Cover!$C$14,\" = \",P65,\" if \",U65))","v":""},{"$f":"IF(N65=\"\",\"\",CONCATENATE(LEFT(O65,LEN(O65)-3),\"_\",Cover!$C$14))","v":""},"",""]
[null,null,null,null,null,null,null,null,null,null,null,9,"Inap","",{"$f":"IF(N66=\"\",\"\",OFFSET(Variables!$E$2,MATCH(N66,Variables!$H$3:$H$45,0),0))","v":""},{"$f":"IF(N66=\"\",\"\",HLOOKUP(M66,'Time Units'!$E$2:$K$3,2,0))","v":""},{"$f":"IF(N66=\"\",\"\",IF(Cover!$C$14>1996,'Time Units'!$D$4,CONCATENATE(O66,\"_\",Cover!$C$14)))","v":""},"",{"$f":"IF(N66=\"\",\"\",IF(R66,INDEX('Time Units'!$B:$K,MATCH(Q66,'Time Units'!$D:$D,0),MATCH(M66,'Time Units'!$B$2:$K$2,0)),0))","v":""},"","",{"$f":"IF(N66=\"\",\"\",CONCATENATE(\"replace \",O66,\"_\",Cover!$C$14,\" = \",P66,\" if \",U66))","v":""},{"$f":"IF(N66=\"\",\"\",CONCATENATE(LEFT(O66,LEN(O66)-3),\"_\",Cover!$C$14))","v":""},"",""]
[null,null,null,null,null,null,null,null,null,null,null,10,"Hour","",{"$f":"IF(N67=\"\",\"\",OFFSET(Variables!$E$2,MATCH(N67,Variables!$H$3:$H$45,0),0))","v":""},{"$f":"IF(N67=\"\",\"\",HLOOKUP(M67,'Time Units'!$E$2:$K$3,2,0))","v":""},{"$f":"IF(N67=\"\",\"\",IF(Cover!$C$14>1996,'Time Units'!$D$4,CONCATENATE(O67,\"_\",Cover!$C$14)))","v":""},"",{"$f":"IF(N67=\"\",\"\",IF(R67,INDEX('Time Units'!$B:$K,MATCH(Q67,'Time Units'!$D:$D,0),MATCH(M67,'Time Units'!$B$2:$K$2,0)),0))","v":""},"","",{"$f":"IF(N67=\"\",\"\",CONCATENATE(\"replace \",O67,\"_\",Cover!$C$14,\" = \",P67,\" if \",U67))","v":""},{"$f":"IF(N67=\"\",\"\",CONCATENATE(LEFT(O67,LEN(O67)-3),\"_\",Cover!$C$14))","v":""},"",""]
[null,null,null,null,null,null,null,null,null,null,null,10,"Day","",{"$f":"IF(N68=\"\",\"\",OFFSET(Variables!$E$2,MATCH(N68,Variables!$H$3:$H$45,0),0))","v":""},{"$f":"IF(N68=\"\",\"\",HLOOKUP(M68,'Time Units'!$E$2:$K$3,2,0))","v":""},{"$f":"IF(N68=\"\",\"\",IF(Cover!$C$14>1996,'Time Units'!$D$4,CONCATENATE(O68,\"_\",Cover!$C$14)))","v":""},"",{"$f":"IF(N68=\"\",\"\",IF(R68,INDEX('Time Units'!$B:$K,MATCH(Q68,'Time Units'!$D:$D,0),MATCH(M68,'Time Units'!$B$2:$K$2,0)),0))","v":""},"","",{"$f":"IF(N68=\"\",\"\",CONCATENATE(\"replace \",O68,\"_\",Cover!$C$14,\" = \",P68,\" if \",U68))","v":""},{"$f":"IF(N68=\"\",\"\",CONCATENATE(LEFT(O68,LEN(O68)-3),\"_\",Cover!$C$14))","v":""},"",{"$f":"IF(N68=\"\",\"\",IF(S68>0,IF(ISNUMBER(Y67),Y67+1,1),IF(ISNUMBER(Y67),Y67,0)))","v":""}]
[null,null,null,null,null,null,null,null,null,null,null,10,"Week",{"$f":"IF(OFFSET($B$3,L69,0)=\"\",\"\",OFFSET($B$3,L69,0))","v":""},{"$f":"IF(N69=\"\",\"\",OFFSET(Variables!$E$2,MATCH(N69,Variables!$H$3:$H$45,0),0))","v":""},{"$f":"IF(N69=\"\",\"\",HLOOKUP(M69,'Time Units'!$E$2:$K$3,2,0))","v":""},{"$f":"IF(N69=\"\",\"\",IF(Cover!$C$14>1996,'Time Units'!$D$4,CONCATENATE(O69,\"_\",Cover!$C$14)))","v":""},{"$f":"IF(N69=\"\",\"\",AND(OFFSET($D$3,MATCH(N69,$B$4:$B$13,0),0)=\"Y\",OFFSET($E$3,MATCH(N69,$B$4:$B$13,0),0)=\"Y\"))","v":""},{"$f":"IF(N69=\"\",\"\",IF(R69,INDEX('Time Units'!$B:$K,MATCH(Q69,'Time Units'!$D:$D,0),MATCH(M69,'Time Units'!$B$2:$K$2,0)),0))","v":""},{"$f":"IF(S69=\"\",\"\",IFERROR(VALUE(S69),\"NA\"))","v":""},{"$f":"IF(T69=\"\",\"\",IF(T69=\"NA\",CONCATENATE(\"inlist(\",Q69,\", \",S69,\")\"),CONCATENATE(O69,\" == \",T69)))","v":""},{"$f":"IF(N69=\"\",\"\",CONCATENATE(\"replace \",O69,\"_\",Cover!$C$14,\" = \",P69,\" if \",U69))","v":""},{"$f":"IF(N69=\"\",\"\",CONCATENATE(LEFT(O69,LEN(O69)-3),\"_\",Cover!$C$14))","v":""},{"$f":"IF(N69=\"\",\"\",CONCATENATE(\"replace \",W69,\" = \",W69))","v":""},""]
[null,null,null,null,null,null,null,null,null,null,null,10,"2 Wks",{"$f":"IF(OFFSET($B$3,L70,0)=\"\",\"\",OFFSET($B$3,L70,0))","v":""},{"$f":"IF(N70=\"\",\"\",OFFSET(Variables!$E$2,MATCH(N70,Variables!$H$3:$H$45,0),0))","v":""},{"$f":"IF(N70=\"\",\"\",HLOOKUP(M70,'Time Units'!$E$2:$K$3,2,0))","v":""},{"$f":"IF(N70=\"\",\"\",IF(Cover!$C$14>1996,'Time Units'!$D$4,CONCATENATE(O70,\"_\",Cover!$C$14)))","v":""},{"$f":"IF(N70=\"\",\"\",AND(OFFSET($D$3,MATCH(N70,$B$4:$B$13,0),0)=\"Y\",OFFSET($E$3,MATCH(N70,$B$4:$B$13,0),0)=\"Y\"))","v":""},{"$f":"IF(N70=\"\",\"\",IF(R70,INDEX('Time Units'!$B:$K,MATCH(Q70,'Time Units'!$D:$D,0),MATCH(M70,'Time Units'!$B$2:$K$2,0)),0))","v":""},{"$f":"IF(S70=\"\",\"\",IFERROR(VALUE(S70),\"NA\"))","v":""},"",{"$f":"IF(N70=\"\",\"\",CONCATENATE(\"replace \",O70,\"_\",Cover!$C$14,\" = \",P70,\" if \",U70))","v":""},{"$f":"IF(N70=\"\",\"\",CONCATENATE(LEFT(O70,LEN(O70)-3),\"_\",Cover!$C$14))","v":""},"",""]
[null,null,null,null,null,null,null,null,null,null,null,10,"Month",{"$f":"IF(OFFSET($B$3,L71,0)=\"\",\"\",OFFSET($B$3,L71,0))","v":""},{"$f":"IF(N71=\"\",\"\",OFFSET(Variables!$E$2,MATCH(N71,Variables!$H$3:$H$45,0),0))","v":""},{"$f":"IF(N71=\"\",\"\",HLOOKUP(M71,'Time Units'!$E$2:$K$3,2,0))","v":""},{"$f":"IF(N71=\"\",\"\",IF(Cover!$C$14>1996,'Time Units'!$D$4,CONCATENATE(O71,\"_\",Cover!$C$14)))","v":""},{"$f":"IF(N71=\"\",\"\",AND(OFFSET($D$3,MATCH(N71,$B$4:$B$13,0),0)=\"Y\",OFFSET($E$3,MATCH(N71,$B$4:$B$13,0),0)=\"Y\"))","v":""},{"$f":"IF(N71=\"\",\"\",IF(R71,INDEX('Time Units'!$B:$K,MATCH(Q71,'Time Units'!$D:$D,0),MATCH(M71,'Time Units'!$B$2:$K$2,0)),0))","v":""},{"$f":"IF(S71=\"\",\"\",IFERROR(VALUE(S71),\"NA\"))","v":""},"",{"$f":"IF(N71=\"\",\"\",CONCATENATE(\"replace \",O71,\"_\",Cover!$C$14,\" = \",P71,\" if \",U71))","v":""},{"$f":"IF(N71=\"\",\"\",CONCATENATE(LEFT(O71,LEN(O71)-3),\"_\",Cover!$C$14))","v":""},"",""]
[null,null,null,null,null,null,null,null,null,null,null,10,"Year",{"$f":"IF(OFFSET($B$3,L72,0)=\"\",\"\",OFFSET($B$3,L72,0))","v":""},{"$f":"IF(N72=\"\",\"\",OFFSET(Variables!$E$2,MATCH(N72,Variables!$H$3:$H$45,0),0))","v":""},{"$f":"IF(N72=\"\",\"\",HLOOKUP(M72,'Time Units'!$E$2:$K$3,2,0))","v":""},{"$f":"IF(N72=\"\",\"\",IF(Cover!$C$14>1996,'Time Units'!$D$4,CONCATENATE(O72,\"_\",Cover!$C$14)))","v":""},{"$f":"IF(N72=\"\",\"\",AND(OFFSET($D$3,MATCH(N72,$B$4:$B$13,0),0)=\"Y\",OFFSET($E$3,MATCH(N72,$B$4:$B$13,0),0)=\"Y\"))","v":""},{"$f":"IF(N72=\"\",\"\",IF(R72,INDEX('Time Units'!$B:$K,MATCH(Q72,'Time Units'!$D:$D,0),MATCH(M72,'Time Units'!$B$2:$K$2,0)),0))","v":""},{"$f":"IF(S72=\"\",\"\",IFERROR(VALUE(S72),\"NA\"))","v":""},"",{"$f":"IF(N72=\"\",\"\",CONCATENATE(\"replace \",O72,\"_\",Cover!$C$14,\" = \",P72,\" if \",U72))","v":""},{"$f":"IF(N72=\"\",\"\",CONCATENATE(LEFT(O72,LEN(O72)-3),\"_\",Cover!$C$14))","v":""},"",""]
[null,null,null,null,null,null,null,null,null,null,null,10,"Inap",{"$f":"IF(OFFSET($B$3,L73,0)=\"\",\"\",OFFSET($B$3,L73,0))","v":""},{"$f":"IF(N73=\"\",\"\",OFFSET(Variables!$E$2,MATCH(N73,Variables!$H$3:$H$45,0),0))","v":""},{"$f":"IF(N73=\"\",\"\",HLOOKUP(M73,'Time Units'!$E$2:$K$3,2,0))","v":""},{"$f":"IF(N73=\"\",\"\",IF(Cover!$C$14>1996,'Time Units'!$D$4,CONCATENATE(O73,\"_\",Cover!$C$14)))","v":""},{"$f":"IF(N73=\"\",\"\",AND(OFFSET($D$3,MATCH(N73,$B$4:$B$13,0),0)=\"Y\",OFFSET($E$3,MATCH(N73,$B$4:$B$13,0),0)=\"Y\"))","v":""},{"$f":"IF(N73=\"\",\"\",IF(R73,INDEX('Time Units'!$B:$K,MATCH(Q73,'Time Units'!$D:$D,0),MATCH(M73,'Time Units'!$B$2:$K$2,0)),0))","v":""},{"$f":"IF(S73=\"\",\"\",IFERROR(VALUE(S73),\"NA\"))","v":""},"",{"$f":"IF(N73=\"\",\"\",CONCATENATE(\"replace \",O73,\"_\",Cover!$C$14,\" = \",P73,\" if \",U73))","v":""},{"$f":"IF(N73=\"\",\"\",CONCATENATE(LEFT(O73,LEN(O73)-3),\"_\",Cover!$C$14))","v":""},"",""]

{"sheet":"TAXSIM","index":6,"n_rows":182,"n_cols":11,"rows_kept":182,"cut":false,"hidden":false,"merged":[]}
[]
[null,"Create TAXSIM Variables (Stata Code)",null,"Comments"]
[]
[null,"****************************************************************************************************"]
[null,"* Section 4: Calculate TAXSIM Inputs"]
[null,"****************************************************************************************************"]
[]
[null,"*** Generate a TAXSIM Identifier",null,"Required by TAXSIM, must be unique and non-negative numeric."]
[null,"gen taxsimid = _n"]
[null,"label var taxsimid \"TAXSIM Identifier\""]
[]
[null,"*** Set Tax Year"]
[null,"* Year of observation used for data cleaning, prior year used for tax calculation"]
[null,{"$f":"CONCATENATE(\"local obs_year = \",Cover!$C$14)","v":"local obs_year = 1968"},null,"Tax calculated for prior year since financial variables from the survey reflect the prior year"]
[null,{"$f":"CONCATENATE(\"gen year = \",Cover!$C$14-1)","v":"gen year = 1967"}]
[]
[null,"*** Set a State Identifier"]
[null,{"$f":"CONCATENATE(\"gen state = .\")","v":"gen state = ."}]
[null,"* Recode state for TAXSIM"]
[null,{"$f":"CONCATENATE(\"replace state = \",Lookup!E3,\" if state1_\",Cover!$C$14,\" == \",Lookup!F3,\"   // \",Lookup!D3)","v":"replace state = 1 if state1_1968 == 1   // AL"}]
[null,{"$f":"CONCATENATE(\"replace state = \",Lookup!E4,\" if state1_\",Cover!$C$14,\" == \",Lookup!F4,\"   // \",Lookup!D4)","v":"replace state = 2 if state1_1968 == 50   // AK"}]
[null,{"$f":"CONCATENATE(\"replace state = \",Lookup!E5,\" if state1_\",Cover!$C$14,\" == \",Lookup!F5,\"   // \",Lookup!D5)","v":"replace state = 3 if state1_1968 == 2   // AZ"}]
[null,{"$f":"CONCATENATE(\"replace state = \",Lookup!E6,\" if state1_\",Cover!$C$14,\" == \",Lookup!F6,\"   // \",Lookup!D6)","v":"replace state = 4 if state1_1968 == 3   // AR"}]
[null,{"$f":"CONCATENATE(\"replace state = \",Lookup!E7,\" if state1_\",Cover!$C$14,\" == \",Lookup!F7,\"   // \",Lookup!D7)","v":"replace state = 5 if state1_1968 == 4   // CA"}]
[null,{"$f":"CONCATENATE(\"replace state = \",Lookup!E8,\" if state1_\",Cover!$C$14,\" == \",Lookup!F8,\"   // \",Lookup!D8)","v":"replace state = 6 if state1_1968 == 5   // CO"}]
[null,{"$f":"CONCATENATE(\"replace state = \",Lookup!E9,\" if state1_\",Cover!$C$14,\" == \",Lookup!F9,\"   // \",Lookup!D9)","v":"replace state = 7 if state1_1968 == 6   // CT"}]
[null,{"$f":"CONCATENATE(\"replace state = \",Lookup!E10,\" if state1_\",Cover!$C$14,\" == \",Lookup!F10,\"   // \",Lookup!D10)","v":"replace state = 8 if state1_1968 == 7   // DE"}]
[null,{"$f":"CONCATENATE(\"replace state = \",Lookup!E11,\" if state1_\",Cover!$C$14,\" == \",Lookup!F11,\"   // \",Lookup!D11)","v":"replace state = 9 if state1_1968 == 8   // DC"}]
[null,{"$f":"CONCATENATE(\"replace state = \",Lookup!E12,\" if state1_\",Cover!$C$14,\" == \",Lookup!F12,\"   // \",Lookup!D12)","v":"replace state = 10 if state1_1968 == 9   // FL"}]
[null,{"$f":"CONCATENATE(\"replace state = \",Lookup!E13,\" if state1_\",Cover!$C$14,\" == \",Lookup!F13,\"   // \",Lookup!D13)","v":"replace state = 11 if state1_1968 == 10   // GA"}]
[null,{"$f":"CONCATENATE(\"replace state = \",Lookup!E14,\" if state1_\",Cover!$C$14,\" == \",Lookup!F14,\"   // \",Lookup!D14)","v":"replace state = 12 if state1_1968 == 51   // HI"}]
[null,{"$f":"CONCATENATE(\"replace state = \",Lookup!E15,\" if state1_\",Cover!$C$14,\" == \",Lookup!F15,\"   // \",Lookup!D15)","v":"replace state = 13 if state1_1968 == 11   // ID"}]
[null,{"$f":"CONCATENATE(\"replace state = \",Lookup!E16,\" if state1_\",Cover!$C$14,\" == \",Lookup!F16,\"   // \",Lookup!D16)","v":"replace state = 14 if state1_1968 == 12   // IL"}]
[null,{"$f":"CONCATENATE(\"replace state = \",Lookup!E17,\" if state1_\",Cover!$C$14,\" == \",Lookup!F17,\"   // \",Lookup!D17)","v":"replace state = 15 if state1_1968 == 13   // IN"}]
[null,{"$f":"CONCATENATE(\"replace state = \",Lookup!E18,\" if state1_\",Cover!$C$14,\" == \",Lookup!F18,\"   // \",Lookup!D18)","v":"replace state = 16 if state1_1968 == 14   // IA"}]
[null,{"$f":"CONCATENATE(\"replace state = \",Lookup!E19,\" if state1_\",Cover!$C$14,\" == \",Lookup!F19,\"   // \",Lookup!D19)","v":"replace state = 17 if state1_1968 == 15   // KS"}]
[null,{"$f":"CONCATENATE(\"replace state = \",Lookup!E20,\" if state1_\",Cover!$C$14,\" == \",Lookup!F20,\"   // \",Lookup!D20)","v":"replace state = 18 if state1_1968 == 16   // KY"}]
[null,{"$f":"CONCATENATE(\"replace state = \",Lookup!E21,\" if state1_\",Cover!$C$14,\" == \",Lookup!F21,\"   // \",Lookup!D21)","v":"replace state = 19 if state1_1968 == 17   // LA"}]
[null,{"$f":"CONCATENATE(\"replace state = \",Lookup!E22,\" if state1_\",Cover!$C$14,\" == \",Lookup!F22,\"   // \",Lookup!D22)","v":"replace state = 20 if state1_1968 == 18   // ME"}]
[null,{"$f":"CONCATENATE(\"replace state = \",Lookup!E23,\" if state1_\",Cover!$C$14,\" == \",Lookup!F23,\"   // \",Lookup!D23)","v":"replace state = 21 if state1_1968 == 19   // MD"}]
[null,{"$f":"CONCATENATE(\"replace state = \",Lookup!E24,\" if state1_\",Cover!$C$14,\" == \",Lookup!F24,\"   // \",Lookup!D24)","v":"replace state = 22 if state1_1968 == 20   // MA"}]
[null,{"$f":"CONCATENATE(\"replace state = \",Lookup!E25,\" if state1_\",Cover!$C$14,\" == \",Lookup!F25,\"   // \",Lookup!D25)","v":"replace state = 23 if state1_1968 == 21   // MI"}]
[null,{"$f":"CONCATENATE(\"replace state = \",Lookup!E26,\" if state1_\",Cover!$C$14,\" == \",Lookup!F26,\"   // \",Lookup!D26)","v":"replace state = 24 if state1_1968 == 22   // MN"}]
[null,{"$f":"CONCATENATE(\"replace state = \",Lookup!E27,\" if state1_\",Cover!$C$14,\" == \",Lookup!F27,\"   // \",Lookup!D27)","v":"replace state = 25 if state1_1968 == 23   // MS"}]
[null,{"$f":"CONCATENATE(\"replace state = \",Lookup!E28,\" if state1_\",Cover!$C$14,\" == \",Lookup!F28,\"   // \",Lookup!D28)","v":"replace state = 26 if state1_1968 == 24   // MO"}]
[null,{"$f":"CONCATENATE(\"replace state = \",Lookup!E29,\" if state1_\",Cover!$C$14,\" == \",Lookup!F29,\"   // \",Lookup!D29)","v":"replace state = 27 if state1_1968 == 25   // MT"}]
[null,{"$f":"CONCATENATE(\"replace state = \",Lookup!E30,\" if state1_\",Cover!$C$14,\" == \",Lookup!F30,\"   // \",Lookup!D30)","v":"replace state = 28 if state1_1968 == 26   // NE"}]
[null,{"$f":"CONCATENATE(\"replace state = \",Lookup!E31,\" if state1_\",Cover!$C$14,\" == \",Lookup!F31,\"   // \",Lookup!D31)","v":"replace state = 29 if state1_1968 == 27   // NV"}]
[null,{"$f":"CONCATENATE(\"replace state = \",Lookup!E32,\" if state1_\",Cover!$C$14,\" == \",Lookup!F32,\"   // \",Lookup!D32)","v":"replace state = 30 if state1_1968 == 28   // NH"}]
[null,{"$f":"CONCATENATE(\"replace state = \",Lookup!E33,\" if state1_\",Cover!$C$14,\" == \",Lookup!F33,\"   // \",Lookup!D33)","v":"replace state = 31 if state1_1968 == 29   // NJ"}]
[null,{"$f":"CONCATENATE(\"replace state = \",Lookup!E34,\" if state1_\",Cover!$C$14,\" == \",Lookup!F34,\"   // \",Lookup!D34)","v":"replace state = 32 if state1_1968 == 30   // NM"}]
[null,{"$f":"CONCATENATE(\"replace state = \",Lookup!E35,\" if state1_\",Cover!$C$14,\" == \",Lookup!F35,\"   // \",Lookup!D35)","v":"replace state = 33 if state1_1968 == 31   // NY"}]
[null,{"$f":"CONCATENATE(\"replace state = \",Lookup!E36,\" if state1_\",Cover!$C$14,\" == \",Lookup!F36,\"   // \",Lookup!D36)","v":"replace state = 34 if state1_1968 == 32   // NC"}]
[null,{"$f":"CONCATENATE(\"replace state = \",Lookup!E37,\" if state1_\",Cover!$C$14,\" == \",Lookup!F37,\"   // \",Lookup!D37)","v":"replace state = 35 if state1_1968 == 33   // ND"}]
[null,{"$f":"CONCATENATE(\"replace state = \",Lookup!E38,\" if state1_\",Cover!$C$14,\" == \",Lookup!F38,\"   // \",Lookup!D38)","v":"replace state = 36 if state1_1968 == 34   // OH"}]
[null,{"$f":"CONCATENATE(\"replace state = \",Lookup!E39,\" if state1_\",Cover!$C$14,\" == \",Lookup!F39,\"   // \",Lookup!D39)","v":"replace state = 37 if state1_1968 == 35   // OK"}]
[null,{"$f":"CONCATENATE(\"replace state = \",Lookup!E40,\" if state1_\",Cover!$C$14,\" == \",Lookup!F40,\"   // \",Lookup!D40)","v":"replace state = 38 if state1_1968 == 36   // OR"}]
[null,{"$f":"CONCATENATE(\"replace state = \",Lookup!E41,\" if state1_\",Cover!$C$14,\" == \",Lookup!F41,\"   // \",Lookup!D41)","v":"replace state = 39 if state1_1968 == 37   // PA"}]
[null,{"$f":"CONCATENATE(\"replace state = \",Lookup!E42,\" if state1_\",Cover!$C$14,\" == \",Lookup!F42,\"   // \",Lookup!D42)","v":"replace state = 40 if state1_1968 == 38   // RI"}]
[null,{"$f":"CONCATENATE(\"replace state = \",Lookup!E43,\" if state1_\",Cover!$C$14,\" == \",Lookup!F43,\"   // \",Lookup!D43)","v":"replace state = 41 if state1_1968 == 39   // SC"}]
[null,{"$f":"CONCATENATE(\"replace state = \",Lookup!E44,\" if state1_\",Cover!$C$14,\" == \",Lookup!F44,\"   // \",Lookup!D44)","v":"replace state = 42 if state1_1968 == 40   // SD"}]
[null,{"$f":"CONCATENATE(\"replace state = \",Lookup!E45,\" if state1_\",Cover!$C$14,\" == \",Lookup!F45,\"   // \",Lookup!D45)","v":"replace state = 43 if state1_1968 == 41   // TN"}]
[null,{"$f":"CONCATENATE(\"replace state = \",Lookup!E46,\" if state1_\",Cover!$C$14,\" == \",Lookup!F46,\"   // \",Lookup!D46)","v":"replace state = 44 if state1_1968 == 42   // TX"}]
[null,{"$f":"CONCATENATE(\"replace state = \",Lookup!E47,\" if state1_\",Cover!$C$14,\" == \",Lookup!F47,\"   // \",Lookup!D47)","v":"replace state = 45 if state1_1968 == 43   // UT"}]
[null,{"$f":"CONCATENATE(\"replace state = \",Lookup!E48,\" if state1_\",Cover!$C$14,\" == \",Lookup!F48,\"   // \",Lookup!D48)","v":"replace state = 46 if state1_1968 == 44   // VT"}]
[null,{"$f":"CONCATENATE(\"replace state = \",Lookup!E49,\" if state1_\",Cover!$C$14,\" == \",Lookup!F49,\"   // \",Lookup!D49)","v":"replace state = 47 if state1_1968 == 45   // VA"}]
[null,{"$f":"CONCATENATE(\"replace state = \",Lookup!E50,\" if state1_\",Cover!$C$14,\" == \",Lookup!F50,\"   // \",Lookup!D50)","v":"replace state = 48 if state1_1968 == 46   // WA"}]
[null,{"$f":"CONCATENATE(\"replace state = \",Lookup!E51,\" if state1_\",Cover!$C$14,\" == \",Lookup!F51,\"   // \",Lookup!D51)","v":"replace state = 49 if state1_1968 == 47   // WV"}]
[null,{"$f":"CONCATENATE(\"replace state = \",Lookup!E52,\" if state1_\",Cover!$C$14,\" == \",Lookup!F52,\"   // \",Lookup!D52)","v":"replace state = 50 if state1_1968 == 48   // WI"}]
[null,{"$f":"CONCATENATE(\"replace state = \",Lookup!E53,\" if state1_\",Cover!$C$14,\" == \",Lookup!F53,\"   // \",Lookup!D53)","v":"replace state = 51 if state1_1968 == 49   // WY"}]
[]
[null,"*** Remove State Tax Calc if Set for Removal"]
[null,"if `CALC_STATE_TAX' == 0 {"]
[null,"     replace state = 0"]
[null,"}"]
[null,"* Remove state tax calculation for years before 1977"]
[null,"replace state = 0 if `obs_year' < 1977"]
[null,"if `obs_year' < 1977 {"]
[null,"     di as error \"no state taxes prior to 1977\""]
[null,"}"]
[]
[null,"*** Set the Head's Marital Status"]
[null,"* Uses reported marital status if available (1977 data +)"]
[null,"* Uses cohabitation status if reported marital status is not available (1968-1976 data)",null,null,"PSID Name","Variable Name","Full Name","Included?","This Year?","Code"]
[null,{"$f":"IF(AND(H85=\"Y\",I85=\"Y\"),J85,IF(AND(H86=\"Y\",I86=\"Y\"),J86,\"di as error \"&CHAR(34)&\"No Marital Status Variable Available\"&CHAR(34)))","v":"gen mstat_temp = mstat2_1968"},null,"Use First","J1 MARITAL STATUS",{"$f":"INDEX(Variables!$B$2:$AT$45,MATCH($E85,Variables!$H$2:$H$45,0),MATCH(\"Variable Name\",Variables!$B$2:$AT$2,0))","v":"mstat1"},{"$f":"CONCATENATE(F85,\"_\",Cover!$C$14)","v":"mstat1_1968"},{"$f":"INDEX(Variables!$B$2:$AT$45,MATCH($E85,Variables!$H$2:$H$45,0),MATCH(\"Included?\",Variables!$B$2:$AT$2,0))","v":"Y"},{"$f":"IF(INDEX(Variables!$1:$1048576,MATCH(F85,Variables!$E:$E,0),MATCH(Cover!$C$14,Variables!$2:$2,0))=\"-\",\"N\",\"Y\")","v":"N"},{"$f":"CONCATENATE(\"gen mstat_temp = \",$G$85)","v":"gen mstat_temp = mstat1_1968"}]
[null,"* Recode marital status for TAXSIM ",null,"Use Second","MARITAL STATUS",{"$f":"INDEX(Variables!$B$2:$AT$45,MATCH($E86,Variables!$H$2:$H$45,0),MATCH(\"Variable Name\",Variables!$B$2:$AT$2,0))","v":"mstat2"},{"$f":"CONCATENATE(F86,\"_\",Cover!$C$14)","v":"mstat2_1968"},{"$f":"INDEX(Variables!$B$2:$AT$45,MATCH($E86,Variables!$H$2:$H$45,0),MATCH(\"Included?\",Variables!$B$2:$AT$2,0))","v":"Y"},{"$f":"IF(INDEX(Variables!$1:$1048576,MATCH(F86,Variables!$E:$E,0),MATCH(Cover!$C$14,Variables!$2:$2,0))=\"-\",\"N\",\"Y\")","v":"Y"},{"$f":"CONCATENATE(\"gen mstat_temp = \",$G$86)","v":"gen mstat_temp = mstat2_1968"}]
[null,"gen mstat = ."]
[null,{"$f":"CONCATENATE(\"replace mstat = \",Lookup!I3,\" if mstat_temp == \",Lookup!J3)","v":"replace mstat = 2 if mstat_temp == 1"},null,"Will not run if no marital status variable included in data set"]
[null,{"$f":"CONCATENATE(\"replace mstat = \",Lookup!I4,\" if mstat_temp == \",Lookup!J4)","v":"replace mstat = 1 if mstat_temp == 2"}]
[null,{"$f":"CONCATENATE(\"replace mstat = \",Lookup!I5,\" if mstat_temp == \",Lookup!J5)","v":"replace mstat = 1 if mstat_temp == 3"}]
[null,{"$f":"CONCATENATE(\"replace mstat = \",Lookup!I6,\" if mstat_temp == \",Lookup!J6)","v":"replace mstat = 1 if mstat_temp == 4"}]
[null,{"$f":"CONCATENATE(\"replace mstat = \",Lookup!I7,\" if mstat_temp == \",Lookup!J7)","v":"replace mstat = 2 if mstat_temp == 5"}]
[null,{"$f":"CONCATENATE(\"replace mstat = \",Lookup!I8,\" if mstat_temp == \",Lookup!J8)","v":"replace mstat = 2 if mstat_temp == 8"}]
[null,"drop mstat_temp"]
[]
[null,"*** Set Number of Dependent Children",null,null,"PSID Name","Variable Name","Full Name","Included?","This Year?","Code","Use?"]
[null,{"$f":"IF(K97,J97,\"* No data for number of dependent children. TAXSIM will default to number of dependent exemptions\")","v":"gen depchild = num_dep2_1968"},null,"Use First","NUMBER OF CHILDREN",{"$f":"INDEX(Variables!$B$2:$AT$45,MATCH($E97,Variables!$H$2:$H$45,0),MATCH(\"Variable Name\",Variables!$B$2:$AT$2,0))","v":"num_dep2"},{"$f":"CONCATENATE(F97,\"_\",Cover!$C$14)","v":"num_dep2_1968"},{"$f":"INDEX(Variables!$B$2:$AT$45,MATCH($E97,Variables!$H$2:$H$45,0),MATCH(\"Included?\",Variables!$B$2:$AT$2,0))","v":"Y"},{"$f":"IF(INDEX(Variables!$1:$1048576,MATCH(F97,Variables!$E:$E,0),MATCH(Cover!$C$14,Variables!$2:$2,0))=\"-\",\"N\",\"Y\")","v":"Y"},{"$f":" CONCATENATE(\"gen depchild = \",G97)","v":"gen depchild = num_dep2_1968"},{"$f":"AND(H97=\"Y\",I97=\"Y\")","v":true}]
[]
[null,"*** Set the Number of Dependent Exemptions",null,null,"PSID Name","Variable Name","Full Name","Included?","This Year?","Code"]
[null,"* If available, uses total # exemptions - (head + wife) exemptions (1970-1989)",null,"Use First","H+W YR # DEPENDENTS",{"$f":"INDEX(Variables!$B$2:$AT$45,MATCH($E100,Variables!$H$2:$H$45,0),MATCH(\"Variable Name\",Variables!$B$2:$AT$2,0))","v":"num_dep1"},{"$f":"CONCATENATE(F100,\"_\",Cover!$C$14)","v":"num_dep1_1968"},{"$f":"INDEX(Variables!$B$2:$AT$45,MATCH($E100,Variables!$H$2:$H$45,0),MATCH(\"Included?\",Variables!$B$2:$AT$2,0))","v":"Y"},{"$f":"IF(INDEX(Variables!$1:$1048576,MATCH(F100,Variables!$E:$E,0),MATCH(Cover!$C$14,Variables!$2:$2,0))=\"-\",\"N\",\"Y\")","v":"N"},{"$f":"CONCATENATE(\"replace depx = \",$G$100,\" - mstat\")","v":"replace depx = num_dep1_1968 - mstat"}]
[null,"* Otherwise uses number of children under 18 + dependents outside of the home (if available)",null,"Use Second","NUMBER OF CHILDREN",{"$f":"INDEX(Variables!$B$2:$AT$45,MATCH($E101,Variables!$H$2:$H$45,0),MATCH(\"Variable Name\",Variables!$B$2:$AT$2,0))","v":"num_dep2"},{"$f":"CONCATENATE(F101,\"_\",Cover!$C$14)","v":"num_dep2_1968"},{"$f":"INDEX(Variables!$B$2:$AT$45,MATCH($E101,Variables!$H$2:$H$45,0),MATCH(\"Included?\",Variables!$B$2:$AT$2,0))","v":"Y"},{"$f":"IF(INDEX(Variables!$1:$1048576,MATCH(F101,Variables!$E:$E,0),MATCH(Cover!$C$14,Variables!$2:$2,0))=\"-\",\"N\",\"Y\")","v":"Y"},{"$f":"CONCATENATE(\"replace depx = \",$G$101)","v":"replace depx = num_dep2_1968"}]
[null,"gen depx = 0",null,"Additional","DEPENDENTS NOT HERE",{"$f":"INDEX(Variables!$B$2:$AT$45,MATCH($E102,Variables!$H$2:$H$45,0),MATCH(\"Variable Name\",Variables!$B$2:$AT$2,0))","v":"num_dep3"},{"$f":"CONCATENATE(F102,\"_\",Cover!$C$14)","v":"num_dep3_1968"},{"$f":"INDEX(Variables!$B$2:$AT$45,MATCH($E102,Variables!$H$2:$H$45,0),MATCH(\"Included?\",Variables!$B$2:$AT$2,0))","v":"Y"},{"$f":"IF(INDEX(Variables!$1:$1048576,MATCH(F102,Variables!$E:$E,0),MATCH(Cover!$C$14,Variables!$2:$2,0))=\"-\",\"N\",\"Y\")","v":"Y"},{"$f":"CONCATENATE(\"replace depx = depx + \",$G$102)","v":"replace depx = depx + num_dep3_1968"}]
[null,{"$f":"IF(AND(H100=\"Y\",I100=\"Y\"),J100,IF(AND(H101=\"Y\",I101=\"Y\"),J101,\"di as error \"&CHAR(34)&\"No dependent exemption variable\"&CHAR(34)))","v":"replace depx = num_dep2_1968"}]
[null,"* Replace if the number of individuals reported elsewhere is greater"]
[null,"replace depx = depchild + mstat if depx < depchild + mstat",null,"No PSID family variable identified which gives number of children between 18 and 24 and in school or the number of dependent adult parents"]
[null,"replace depx = 0 if depx < 0 // Does not permit negative exemption numbers",null,"Top code for NUMBER OF CHILDREN changes by year"]
[null,{"$f":"IF(AND(B103=J101,H102=\"Y\",I102=\"Y\"),J102,\"* Dependents outside of the home not added\")","v":"replace depx = depx + num_dep3_1968"}]
[]
[null,"*** Set the Age Indicator for the Filing Individual / Couple",null,null,"PSID Name","Variable Name","Full Name","Included?","This Year?","Code"]
[null,"* Follows rules specified at http://users.nber.org/~taxsim/taxsim9/",null,"Head's Age","AGE OF HEAD",{"$f":"INDEX(Variables!$B$2:$AT$45,MATCH($E110,Variables!$H$2:$H$45,0),MATCH(\"Variable Name\",Variables!$B$2:$AT$2,0))","v":"age1"},{"$f":"CONCATENATE(F110,\"_\",Cover!$C$14)","v":"age1_1968"},{"$f":"INDEX(Variables!$B$2:$AT$45,MATCH($E110,Variables!$H$2:$H$45,0),MATCH(\"Included?\",Variables!$B$2:$AT$2,0))","v":"Y"},{"$f":"IF(INDEX(Variables!$1:$1048576,MATCH(F110,Variables!$E:$E,0),MATCH(Cover!$C$14,Variables!$2:$2,0))=\"-\",\"N\",\"Y\")","v":"Y"},{"$f":"CONCATENATE(\"replace agex = agex + 1 if \",G110,\" > 65 & \",G110,\" ~= .\")","v":"replace agex = agex + 1 if age1_1968 > 65 & age1_1968 ~= ."}]
[null,"gen agex = 0",null,"Spouse's Age","AGE OF WIFE",{"$f":"INDEX(Variables!$B$2:$AT$45,MATCH($E111,Variables!$H$2:$H$45,0),MATCH(\"Variable Name\",Variables!$B$2:$AT$2,0))","v":"age2"},{"$f":"CONCATENATE(F111,\"_\",Cover!$C$14)","v":"age2_1968"},{"$f":"INDEX(Variables!$B$2:$AT$45,MATCH($E111,Variables!$H$2:$H$45,0),MATCH(\"Included?\",Variables!$B$2:$AT$2,0))","v":"Y"},{"$f":"IF(INDEX(Variables!$1:$1048576,MATCH(F111,Variables!$E:$E,0),MATCH(Cover!$C$14,Variables!$2:$2,0))=\"-\",\"N\",\"Y\")","v":"Y"},{"$f":"CONCATENATE(\"replace agex = agex + 1 if \",G111,\" > 65 & \",G111,\" ~= .\")","v":"replace agex = agex + 1 if age2_1968 > 65 & age2_1968 ~= ."}]
[null,{"$f":"IF(AND(H110=\"Y\",I110=\"Y\"),J110,\"di as error \"&CHAR(34)&\"Head's age not included\"&CHAR(34))","v":"replace agex = agex + 1 if age1_1968 > 65 & age1_1968 ~= ."}]
[null,{"$f":"IF(AND(H111=\"Y\",I111=\"Y\"),J111,\"di as error \"&CHAR(34)&\"Spouse's age not included\"&CHAR(34))","v":"replace agex = agex + 1 if age2_1968 > 65 & age2_1968 ~= ."}]
[null,null,null,null,"PSID Name","Variable Name","Full Name","Included?","This Year?","Code"]
[null,"*** Set the Head's Wage and Salary Income",null,"Use First","HDS LABOR INCOME",{"$f":"INDEX(Variables!$B$2:$AT$45,MATCH($E115,Variables!$H$2:$H$45,0),MATCH(\"Variable Name\",Variables!$B$2:$AT$2,0))","v":"wages1"},{"$f":"CONCATENATE(F115,\"_\",Cover!$C$14)","v":"wages1_1968"},{"$f":"INDEX(Variables!$B$2:$AT$45,MATCH($E115,Variables!$H$2:$H$45,0),MATCH(\"Included?\",Variables!$B$2:$AT$2,0))","v":"Y"},{"$f":"IF(INDEX(Variables!$1:$1048576,MATCH(F115,Variables!$E:$E,0),MATCH(Cover!$C$14,Variables!$2:$2,0))=\"-\",\"N\",\"Y\")","v":"Y"},{"$f":"CONCATENATE(\"gen pwages = \",$G$115)","v":"gen pwages = wages1_1968"}]
[null,{"$f":"IF(I115=\"Y\",J115,\"di as error \"&CHAR(34)&\"Head's wages not included\"&CHAR(34))","v":"gen pwages = wages1_1968"},null,"Will not run if head's wages not included in data set"]
[]
[null,"*** Set the Spouse's Wage and Salary Income",null,null,"PSID Name","Variable Name","Full Name","Included?","This Year?","Code"]
[null,"* Uses total labor income if available (1993 and earlier)",null,"Use First","LABOR INC WIFE",{"$f":"INDEX(Variables!$B$2:$AT$45,MATCH($E119,Variables!$H$2:$H$45,0),MATCH(\"Variable Name\",Variables!$B$2:$AT$2,0))","v":"wages2"},{"$f":"CONCATENATE(F119,\"_\",Cover!$C$14)","v":"wages2_1968"},{"$f":"INDEX(Variables!$B$2:$AT$45,MATCH($E119,Variables!$H$2:$H$45,0),MATCH(\"Included?\",Variables!$B$2:$AT$2,0))","v":"Y"},{"$f":"IF(INDEX(Variables!$1:$1048576,MATCH(F119,Variables!$E:$E,0),MATCH(Cover!$C$14,Variables!$2:$2,0))=\"-\",\"N\",\"Y\")","v":"Y"},{"$f":"CONCATENATE(\"gen swages = \",G119)","v":"gen swages = wages2_1968"}]
[null,"* Sums non-business and business labor income variables across categories (1993+)",null,"Use Second","LABOR INCOME OF WIFE",{"$f":"INDEX(Variables!$B$2:$AT$45,MATCH($E120,Variables!$H$2:$H$45,0),MATCH(\"Variable Name\",Variables!$B$2:$AT$2,0))","v":"wages3"},{"$f":"CONCATENATE(F120,\"_\",Cover!$C$14)","v":"wages3_1968"},{"$f":"INDEX(Variables!$B$2:$AT$45,MATCH($E120,Variables!$H$2:$H$45,0),MATCH(\"Included?\",Variables!$B$2:$AT$2,0))","v":"Y"},{"$f":"IF(INDEX(Variables!$1:$1048576,MATCH(F120,Variables!$E:$E,0),MATCH(Cover!$C$14,Variables!$2:$2,0))=\"-\",\"N\",\"Y\")","v":"N"},{"$f":"CONCATENATE(\"gen swages = \",G120)","v":"gen swages = wages3_1968"}]
[null,{"$f":"IF(AND(H119=\"Y\",I119=\"Y\"),J119,IF(AND(H120=\"Y\",I120=\"Y\"),J120,\"di as error \"&CHAR(34)&\"Spouse's wages not included\"&CHAR(34)))","v":"gen swages = wages2_1968"},null,"Additional","WF LABOR PART OF YR-1 BUSINESS INCOME",{"$f":"INDEX(Variables!$B$2:$AT$45,MATCH($E121,Variables!$H$2:$H$45,0),MATCH(\"Variable Name\",Variables!$B$2:$AT$2,0))","v":"wages4"},{"$f":"CONCATENATE(F121,\"_\",Cover!$C$14)","v":"wages4_1968"},{"$f":"INDEX(Variables!$B$2:$AT$45,MATCH($E121,Variables!$H$2:$H$45,0),MATCH(\"Included?\",Variables!$B$2:$AT$2,0))","v":"Y"},{"$f":"IF(INDEX(Variables!$1:$1048576,MATCH(F121,Variables!$E:$E,0),MATCH(Cover!$C$14,Variables!$2:$2,0))=\"-\",\"N\",\"Y\")","v":"N"},{"$f":"CONCATENATE(\"replace swages = swages + \",$G$121)","v":"replace swages = swages + wages4_1968"}]
[null,{"$f":"IF(AND(B121=J120,H121=\"Y\",I121=\"Y\"),J121,\"* Business labor income not added\")","v":"* Business labor income not added"}]
[]
[null,"*** Set Pension Income",null,null,"PSID Name","Variable Name","Full Name","Included?","This Year?","Code"]
[null,"* Pension income for 1968-1969 surveys not calculated because only bracketed data available",null,"Use First","OTHER RETIREMENT",{"$f":"INDEX(Variables!$B$2:$AT$45,MATCH($E125,Variables!$H$2:$H$45,0),MATCH(\"Variable Name\",Variables!$B$2:$AT$2,0))","v":"pension_inc1"},{"$f":"CONCATENATE(F125,\"_\",Cover!$C$14)","v":"pension_inc1_1968"},{"$f":"INDEX(Variables!$B$2:$AT$45,MATCH($E125,Variables!$H$2:$H$45,0),MATCH(\"Included?\",Variables!$B$2:$AT$2,0))","v":"Y"},{"$f":"IF(INDEX(Variables!$1:$1048576,MATCH(F125,Variables!$E:$E,0),MATCH(Cover!$C$14,Variables!$2:$2,0))=\"-\",\"N\",\"Y\")","v":"N"},{"$f":" CONCATENATE(\"replace pensions = \",G125)","v":"replace pensions = pension_inc1_1968"}]
[null,"gen pensions = 0",null,"Use Second","HD OTHER RETIREMENT",{"$f":"INDEX(Variables!$B$2:$AT$45,MATCH($E126,Variables!$H$2:$H$45,0),MATCH(\"Variable Name\",Variables!$B$2:$AT$2,0))","v":"pension_inc2"},{"$f":"CONCATENATE(F126,\"_\",Cover!$C$14)","v":"pension_inc2_1968"},{"$f":"INDEX(Variables!$B$2:$AT$45,MATCH($E126,Variables!$H$2:$H$45,0),MATCH(\"Included?\",Variables!$B$2:$AT$2,0))","v":"Y"},{"$f":"IF(INDEX(Variables!$1:$1048576,MATCH(F126,Variables!$E:$E,0),MATCH(Cover!$C$14,Variables!$2:$2,0))=\"-\",\"N\",\"Y\")","v":"N"},{"$f":" CONCATENATE(\"replace pensions = \",G126)","v":"replace pensions = pension_inc2_1968"}]
[null,{"$f":"IF(AND(H125=\"Y\",I125=\"Y\"),J125,IF(AND(H126=\"Y\",I126=\"Y\"),J126,IF(AND(H128=\"Y\",I128=\"Y\"),J128,\"di as error \"&CHAR(34)&\"Head's pension income not included\"&CHAR(34))))","v":"di as error \"Head's pension income not included\""},null,"Additional","HD YR-1 VA PENSION",{"$f":"INDEX(Variables!$B$2:$AT$45,MATCH($E127,Variables!$H$2:$H$45,0),MATCH(\"Variable Name\",Variables!$B$2:$AT$2,0))","v":"pension_inc3"},{"$f":"CONCATENATE(F127,\"_\",Cover!$C$14)","v":"pension_inc3_1968"},{"$f":"INDEX(Variables!$B$2:$AT$45,MATCH($E127,Variables!$H$2:$H$45,0),MATCH(\"Included?\",Variables!$B$2:$AT$2,0))","v":"Y"},{"$f":"IF(INDEX(Variables!$1:$1048576,MATCH(F127,Variables!$E:$E,0),MATCH(Cover!$C$14,Variables!$2:$2,0))=\"-\",\"N\",\"Y\")","v":"N"},{"$f":" CONCATENATE(\"replace pensions = pensions + \",G127)","v":"replace pensions = pensions + pension_inc3_1968"}]
[null,{"$f":"IF(AND(B127=J126,H127=\"Y\",I127=\"Y\"),J127,\"* No additional head pension data required\")","v":"* No additional head pension data required"},null,"Use Third","HD REPORTED ANNUITY/IRA INCOME",{"$f":"INDEX(Variables!$B$2:$AT$45,MATCH($E128,Variables!$H$2:$H$45,0),MATCH(\"Variable Name\",Variables!$B$2:$AT$2,0))","v":"pension_inc8"},{"$f":"CONCATENATE(F128,\"_\",Cover!$C$14)","v":"pension_inc8_1968"},{"$f":"INDEX(Variables!$B$2:$AT$45,MATCH($E128,Variables!$H$2:$H$45,0),MATCH(\"Included?\",Variables!$B$2:$AT$2,0))","v":"Y"},{"$f":"IF(INDEX(Variables!$1:$1048576,MATCH(F128,Variables!$E:$E,0),MATCH(Cover!$C$14,Variables!$2:$2,0))=\"-\",\"N\",\"Y\")","v":"N"},{"$f":" CONCATENATE(\"replace pensions = \",G128)","v":"replace pensions = pension_inc8_1968"}]
[null,"* Calculate spouse's pension income (1985 + )",null,"Spouse 1","WF OTHER RETIREMENT YR-1",{"$f":"INDEX(Variables!$B$2:$AT$45,MATCH($E129,Variables!$H$2:$H$45,0),MATCH(\"Variable Name\",Variables!$B$2:$AT$2,0))","v":"pension_inc4"},{"$f":"CONCATENATE(F129,\"_\",Cover!$C$14)","v":"pension_inc4_1968"},{"$f":"INDEX(Variables!$B$2:$AT$45,MATCH($E129,Variables!$H$2:$H$45,0),MATCH(\"Included?\",Variables!$B$2:$AT$2,0))","v":"Y"},{"$f":"IF(INDEX(Variables!$1:$1048576,MATCH(F129,Variables!$E:$E,0),MATCH(Cover!$C$14,Variables!$2:$2,0))=\"-\",\"N\",\"Y\")","v":"N"},{"$f":"CONCATENATE(\"replace spouse_pensions = spouse_pensions + \",G129)","v":"replace spouse_pensions = spouse_pensions + pension_inc4_1968"}]
[null,"gen spouse_pensions = 0",null,"Spouse 2","WF YR-1 VA PENSION",{"$f":"INDEX(Variables!$B$2:$AT$45,MATCH($E130,Variables!$H$2:$H$45,0),MATCH(\"Variable Name\",Variables!$B$2:$AT$2,0))","v":"pension_inc5"},{"$f":"CONCATENATE(F130,\"_\",Cover!$C$14)","v":"pension_inc5_1968"},{"$f":"INDEX(Variables!$B$2:$AT$45,MATCH($E130,Variables!$H$2:$H$45,0),MATCH(\"Included?\",Variables!$B$2:$AT$2,0))","v":"Y"},{"$f":"IF(INDEX(Variables!$1:$1048576,MATCH(F130,Variables!$E:$E,0),MATCH(Cover!$C$14,Variables!$2:$2,0))=\"-\",\"N\",\"Y\")","v":"N"},{"$f":"CONCATENATE(\"replace spouse_pensions = spouse_pensions + \",G130)","v":"replace spouse_pensions = spouse_pensions + pension_inc5_1968"}]
[null,{"$f":"IF(AND(H129=\"Y\",I129=\"Y\"),J129,IF(AND(H131=\"Y\",I131=\"Y\"),J131,\"di \"&CHAR(34)&\"Spouse's pension income not included\"&CHAR(34)))","v":"di \"Spouse's pension income not included\""},null,"Spouse 3","WF REPRTD PENSION/ANNUITY INCOME",{"$f":"INDEX(Variables!$B$2:$AT$45,MATCH($E131,Variables!$H$2:$H$45,0),MATCH(\"Variable Name\",Variables!$B$2:$AT$2,0))","v":"pension_inc6"},{"$f":"CONCATENATE(F131,\"_\",Cover!$C$14)","v":"pension_inc6_1968"},{"$f":"INDEX(Variables!$B$2:$AT$45,MATCH($E131,Variables!$H$2:$H$45,0),MATCH(\"Included?\",Variables!$B$2:$AT$2,0))","v":"Y"},{"$f":"IF(INDEX(Variables!$1:$1048576,MATCH(F131,Variables!$E:$E,0),MATCH(Cover!$C$14,Variables!$2:$2,0))=\"-\",\"N\",\"Y\")","v":"N"},{"$f":"CONCATENATE(\"replace spouse_pensions = spouse_pensions + \",G131)","v":"replace spouse_pensions = spouse_pensions + pension_inc6_1968"}]
[null,{"$f":"IF(AND(B131=J129,H130=\"Y\",I130=\"Y\"),J130,\"* No additional spouse pension data required\")","v":"* No additional spouse pension data required"}]
[null,"* Sum pensions across the head and spouse",null,"Top code for HD-YR-1 VA PENSION changes by year."]
[null,"replace pensions = pensions + spouse_pensions"]
[null,"drop spouse_pensions"]
[]
[null,"*** Set Other Property Income",null,null,"PSID Name","Variable Name","Full Name","Included?","This Year?","Code"]
[null,"gen otherprop = 0",null,"Use First","H+W TAXABLE INC",{"$f":"INDEX(Variables!$B$2:$AT$45,MATCH($E138,Variables!$H$2:$H$45,0),MATCH(\"Variable Name\",Variables!$B$2:$AT$2,0))","v":"tax_inc1"},{"$f":"CONCATENATE(F138,\"_\",Cover!$C$14)","v":"tax_inc1_1968"},{"$f":"INDEX(Variables!$B$2:$AT$45,MATCH($E138,Variables!$H$2:$H$45,0),MATCH(\"Included?\",Variables!$B$2:$AT$2,0))","v":"Y"},{"$f":"IF(INDEX(Variables!$1:$1048576,MATCH(F138,Variables!$E:$E,0),MATCH(Cover!$C$14,Variables!$2:$2,0))=\"-\",\"N\",\"Y\")","v":"Y"},{"$f":" CONCATENATE(\"replace otherprop = \",G138,\" - pensions - pwages - swages if \",G138,\" > pensions + pwages + swages\")","v":"replace otherprop = tax_inc1_1968 - pensions - pwages - swages if tax_inc1_1968 > pensions + pwages + swages"}]
[null,{"$f":"IF(AND(H138=\"Y\",I138=\"Y\"),J138,\"* Other property income not calculated because taxable income not included in dataset\")","v":"replace otherprop = tax_inc1_1968 - pensions - pwages - swages if tax_inc1_1968 > pensions + pwages + swages"}]
[]
[null,"*** Set Social Security Benefits",null,null,"PSID Name","Variable Name","Full Name","Included?","This Year?","Code"]
[null,"* Uses combined head and wife social security income if available (1970-1985)",null,"Use First","SOCIAL SECURITY",{"$f":"INDEX(Variables!$B$2:$AT$45,MATCH($E142,Variables!$H$2:$H$45,0),MATCH(\"Variable Name\",Variables!$B$2:$AT$2,0))","v":"gssi1"},{"$f":"CONCATENATE(F142,\"_\",Cover!$C$14)","v":"gssi1_1968"},{"$f":"INDEX(Variables!$B$2:$AT$45,MATCH($E142,Variables!$H$2:$H$45,0),MATCH(\"Included?\",Variables!$B$2:$AT$2,0))","v":"Y"},{"$f":"IF(INDEX(Variables!$1:$1048576,MATCH(F142,Variables!$E:$E,0),MATCH(Cover!$C$14,Variables!$2:$2,0))=\"-\",\"N\",\"Y\")","v":"N"},{"$f":" CONCATENATE(\"replace gssi = \",G142)","v":"replace gssi = gssi1_1968"}]
[null,"* Else sums head and wife social security income if available (1986-1993, 2005+)",null,"Use Second","HD YR SOCIAL SECURITY",{"$f":"INDEX(Variables!$B$2:$AT$45,MATCH($E143,Variables!$H$2:$H$45,0),MATCH(\"Variable Name\",Variables!$B$2:$AT$2,0))","v":"gssi2"},{"$f":"CONCATENATE(F143,\"_\",Cover!$C$14)","v":"gssi2_1968"},{"$f":"INDEX(Variables!$B$2:$AT$45,MATCH($E143,Variables!$H$2:$H$45,0),MATCH(\"Included?\",Variables!$B$2:$AT$2,0))","v":"Y"},{"$f":"IF(INDEX(Variables!$1:$1048576,MATCH(F143,Variables!$E:$E,0),MATCH(Cover!$C$14,Variables!$2:$2,0))=\"-\",\"N\",\"Y\")","v":"N"},{"$f":" CONCATENATE(\"replace gssi = \",G143)","v":"replace gssi = gssi2_1968"}]
[null,"* Otherwise uses combined family income",null,"Additional","WF YR SOCIAL SECURITY",{"$f":"INDEX(Variables!$B$2:$AT$45,MATCH($E144,Variables!$H$2:$H$45,0),MATCH(\"Variable Name\",Variables!$B$2:$AT$2,0))","v":"gssi3"},{"$f":"CONCATENATE(F144,\"_\",Cover!$C$14)","v":"gssi3_1968"},{"$f":"INDEX(Variables!$B$2:$AT$45,MATCH($E144,Variables!$H$2:$H$45,0),MATCH(\"Included?\",Variables!$B$2:$AT$2,0))","v":"Y"},{"$f":"IF(INDEX(Variables!$1:$1048576,MATCH(F144,Variables!$E:$E,0),MATCH(Cover!$C$14,Variables!$2:$2,0))=\"-\",\"N\",\"Y\")","v":"N"},{"$f":" CONCATENATE(\"replace gssi = gssi + \",G144)","v":"replace gssi = gssi + gssi3_1968"}]
[null,"gen gssi = 0",null,"Use Third","TOTAL FAMILY SOCIAL SECURITY INCOME",{"$f":"INDEX(Variables!$B$2:$AT$45,MATCH($E145,Variables!$H$2:$H$45,0),MATCH(\"Variable Name\",Variables!$B$2:$AT$2,0))","v":"gssi4"},{"$f":"CONCATENATE(F145,\"_\",Cover!$C$14)","v":"gssi4_1968"},{"$f":"INDEX(Variables!$B$2:$AT$45,MATCH($E145,Variables!$H$2:$H$45,0),MATCH(\"Included?\",Variables!$B$2:$AT$2,0))","v":"Y"},{"$f":"IF(INDEX(Variables!$1:$1048576,MATCH(F145,Variables!$E:$E,0),MATCH(Cover!$C$14,Variables!$2:$2,0))=\"-\",\"N\",\"Y\")","v":"N"},{"$f":" CONCATENATE(\"replace gssi = \",G145)","v":"replace gssi = gssi4_1968"}]
[null,{"$f":"IF(AND(H142=\"Y\",I142=\"Y\"),J142,IF(AND(H143=\"Y\",I143=\"Y\"),J143,IF(AND(H145=\"Y\",I145=\"Y\"),J145,\"di as error \"&CHAR(34)&\"Social security income not included\"&CHAR(34))))","v":"di as error \"Social security income not included\""}]
[null,{"$f":"IF(AND(B146=J143,H144=\"Y\",I144=\"Y\"),J144,\"* Data does not require addition of spouse's social security income\")","v":"* Data does not require addition of spouse's social security income"}]
[]
[null,"*** Set Unemployment Income",null,null,"PSID Name","Variable Name","Full Name","Included?","This Year?","Code","Use?"]
[null,"* No unemployment income available prior to the 1970 survey",null,"Use First","UNEMP,WRK.COMP",{"$f":"INDEX(Variables!$B$2:$AT$45,MATCH($E150,Variables!$H$2:$H$45,0),MATCH(\"Variable Name\",Variables!$B$2:$AT$2,0))","v":"unemp_inc1"},{"$f":"CONCATENATE(F150,\"_\",Cover!$C$14)","v":"unemp_inc1_1968"},{"$f":"INDEX(Variables!$B$2:$AT$45,MATCH($E150,Variables!$H$2:$H$45,0),MATCH(\"Included?\",Variables!$B$2:$AT$2,0))","v":"Y"},{"$f":"IF(INDEX(Variables!$1:$1048576,MATCH(F150,Variables!$E:$E,0),MATCH(Cover!$C$14,Variables!$2:$2,0))=\"-\",\"N\",\"Y\")","v":"N"},{"$f":" CONCATENATE(\"replace ui = \",G150)","v":"replace ui = unemp_inc1_1968"},{"$f":"AND(H150=\"Y\",I150=\"Y\")","v":false}]
[null,"* Uses only head's unemployment income 1970-1984 (only head's available)",null,"Use Second","HD YR UNEMPLOYMENTCOMP",{"$f":"INDEX(Variables!$B$2:$AT$45,MATCH($E151,Variables!$H$2:$H$45,0),MATCH(\"Variable Name\",Variables!$B$2:$AT$2,0))","v":"unemp_inc2"},{"$f":"CONCATENATE(F151,\"_\",Cover!$C$14)","v":"unemp_inc2_1968"},{"$f":"INDEX(Variables!$B$2:$AT$45,MATCH($E151,Variables!$H$2:$H$45,0),MATCH(\"Included?\",Variables!$B$2:$AT$2,0))","v":"Y"},{"$f":"IF(INDEX(Variables!$1:$1048576,MATCH(F151,Variables!$E:$E,0),MATCH(Cover!$C$14,Variables!$2:$2,0))=\"-\",\"N\",\"Y\")","v":"N"},{"$f":" CONCATENATE(\"replace ui = \",G151)","v":"replace ui = unemp_inc2_1968"},{"$f":"AND(NOT(K150),H151=\"Y\",I151=\"Y\")","v":false}]
[null,"* Sums head and spouse unemployment income 1984+",null,"Additional","WF YR-1 UNEMP COMP",{"$f":"INDEX(Variables!$B$2:$AT$45,MATCH($E152,Variables!$H$2:$H$45,0),MATCH(\"Variable Name\",Variables!$B$2:$AT$2,0))","v":"unemp_inc3"},{"$f":"CONCATENATE(F152,\"_\",Cover!$C$14)","v":"unemp_inc3_1968"},{"$f":"INDEX(Variables!$B$2:$AT$45,MATCH($E152,Variables!$H$2:$H$45,0),MATCH(\"Included?\",Variables!$B$2:$AT$2,0))","v":"Y"},{"$f":"IF(INDEX(Variables!$1:$1048576,MATCH(F152,Variables!$E:$E,0),MATCH(Cover!$C$14,Variables!$2:$2,0))=\"-\",\"N\",\"Y\")","v":"N"},{"$f":"CONCATENATE(\"replace ui = ui + \",G152)","v":"replace ui = ui + unemp_inc3_1968"},{"$f":"AND(K151,H152=\"Y\",I152=\"Y\")","v":false}]
[null,"gen ui = 0",null,"Use Third","HD REPORTED UNEMPL COMP INCOME",{"$f":"INDEX(Variables!$B$2:$AT$45,MATCH($E153,Variables!$H$2:$H$45,0),MATCH(\"Variable Name\",Variables!$B$2:$AT$2,0))","v":"unemp_inc4"},{"$f":"CONCATENATE(F153,\"_\",Cover!$C$14)","v":"unemp_inc4_1968"},{"$f":"INDEX(Variables!$B$2:$AT$45,MATCH($E153,Variables!$H$2:$H$45,0),MATCH(\"Included?\",Variables!$B$2:$AT$2,0))","v":"Y"},{"$f":"IF(INDEX(Variables!$1:$1048576,MATCH(F153,Variables!$E:$E,0),MATCH(Cover!$C$14,Variables!$2:$2,0))=\"-\",\"N\",\"Y\")","v":"N"},{"$f":" CONCATENATE(\"replace ui = \",G153)","v":"replace ui = unemp_inc4_1968"},{"$f":"AND(NOT(K150),NOT(K152),H153=\"Y\",I153=\"Y\")","v":false}]
[null,{"$f":"IF(K150,J150,IF(K151,J151,IF(K153,J153,\"di as error \"&CHAR(34)&\"Unemployment income not included\"&CHAR(34))))","v":"di as error \"Unemployment income not included\""},null,"Additional","WF REPORTED UNEMP COMPENSATION",{"$f":"INDEX(Variables!$B$2:$AT$45,MATCH($E154,Variables!$H$2:$H$45,0),MATCH(\"Variable Name\",Variables!$B$2:$AT$2,0))","v":"unemp_inc6"},{"$f":"CONCATENATE(F154,\"_\",Cover!$C$14)","v":"unemp_inc6_1968"},{"$f":"INDEX(Variables!$B$2:$AT$45,MATCH($E154,Variables!$H$2:$H$45,0),MATCH(\"Included?\",Variables!$B$2:$AT$2,0))","v":"Y"},{"$f":"IF(INDEX(Variables!$1:$1048576,MATCH(F154,Variables!$E:$E,0),MATCH(Cover!$C$14,Variables!$2:$2,0))=\"-\",\"N\",\"Y\")","v":"N"},{"$f":"CONCATENATE(\"replace ui = ui + \",G154)","v":"replace ui = ui + unemp_inc6_1968"},{"$f":"AND(K153,H154=\"Y\",I154=\"Y\")","v":false}]
[null,{"$f":"IF(K152,J152,IF(K154,J154,IF(K150,\"* Data does not require addition of spouse's unemployment income\",\"di as error \"&CHAR(34)&\"Spouse's unemployement income not included\"&CHAR(34))))","v":"di as error \"Spouse's unemployement income not included\""}]
[]
[null,"*** Set Government Transfer Income",null,null,"PSID Name","Variable Name","Full Name","Included?","This Year?","Code"]
[null,"* Measured (when available) as total transfer income less unemployment income",null,"Use First","TRANSFER Y H+W",{"$f":"INDEX(Variables!$B$2:$AT$45,MATCH($E158,Variables!$H$2:$H$45,0),MATCH(\"Variable Name\",Variables!$B$2:$AT$2,0))","v":"transfers1"},{"$f":"CONCATENATE(F158,\"_\",Cover!$C$14)","v":"transfers1_1968"},{"$f":"INDEX(Variables!$B$2:$AT$45,MATCH($E158,Variables!$H$2:$H$45,0),MATCH(\"Included?\",Variables!$B$2:$AT$2,0))","v":"Y"},{"$f":"IF(INDEX(Variables!$1:$1048576,MATCH(F158,Variables!$E:$E,0),MATCH(Cover!$C$14,Variables!$2:$2,0))=\"-\",\"N\",\"Y\")","v":"N"},{"$f":" CONCATENATE(\"replace transfers = \",G158,\" - ui\")","v":"replace transfers = transfers1_1968 - ui"}]
[null,"gen transfers = 0"]
[null,{"$f":"IF(AND(H158=\"Y\",I158=\"Y\"),J158,\"di as error \"&CHAR(34)&\"Government transfer income not included\"&CHAR(34))","v":"di as error \"Government transfer income not included\""}]
[]
[null,"*** Set Rent Paid",null,null,"PSID Name","Variable Name","Full Name","Included?","This Year?","Code","Use?"]
[null,"gen rentpaid = 0",null,"Use First","YRLY RENT PAYTS",{"$f":"INDEX(Variables!$B$2:$AT$45,MATCH($E163,Variables!$H$2:$H$45,0),MATCH(\"Variable Name\",Variables!$B$2:$AT$2,0))","v":"rent1"},{"$f":"CONCATENATE(F163,\"_\",Cover!$C$14)","v":"rent1_1968"},{"$f":"INDEX(Variables!$B$2:$AT$45,MATCH($E163,Variables!$H$2:$H$45,0),MATCH(\"Included?\",Variables!$B$2:$AT$2,0))","v":"Y"},{"$f":"IF(INDEX(Variables!$1:$1048576,MATCH(F163,Variables!$E:$E,0),MATCH(Cover!$C$14,Variables!$2:$2,0))=\"-\",\"N\",\"Y\")","v":"Y"},{"$f":" CONCATENATE(\"replace rentpaid = \",G163)","v":"replace rentpaid = rent1_1968"},{"$f":"AND(H163=\"Y\",I163=\"Y\")","v":true}]
[null,{"$f":"IF(K163,J163,IF(K164,J164,\"* Rent paid not calculated\"))","v":"replace rentpaid = rent1_1968"},null,"Use Second","DOLLARS RENT",{"$f":"INDEX(Variables!$B$2:$AT$45,MATCH($E164,Variables!$H$2:$H$45,0),MATCH(\"Variable Name\",Variables!$B$2:$AT$2,0))","v":"rent2"},{"$f":"CONCATENATE(F164,\"_\",Cover!$C$14)","v":"rent2_1968"},{"$f":"INDEX(Variables!$B$2:$AT$45,MATCH($E164,Variables!$H$2:$H$45,0),MATCH(\"Included?\",Variables!$B$2:$AT$2,0))","v":"Y"},{"$f":"IF(INDEX(Variables!$1:$1048576,MATCH(F164,Variables!$E:$E,0),MATCH(Cover!$C$14,Variables!$2:$2,0))=\"-\",\"N\",\"Y\")","v":"N"},{"$f":" CONCATENATE(\"replace rentpaid = \",G164)","v":"replace rentpaid = rent2_1968"},{"$f":"AND(NOT(K163),H164=\"Y\",I164=\"Y\")","v":false}]
[]
[null,"*** Set Estimated Property Tax Payments",null,null,"PSID Name","Variable Name","Full Name","Included?","This Year?","Code","Use?"]
[null,"gen proptax = 0",null,"Use First","YRLY PROP TAXES",{"$f":"INDEX(Variables!$B$2:$AT$45,MATCH($E167,Variables!$H$2:$H$45,0),MATCH(\"Variable Name\",Variables!$B$2:$AT$2,0))","v":"prop_tax1"},{"$f":"CONCATENATE(F167,\"_\",Cover!$C$14)","v":"prop_tax1_1968"},{"$f":"INDEX(Variables!$B$2:$AT$45,MATCH($E167,Variables!$H$2:$H$45,0),MATCH(\"Included?\",Variables!$B$2:$AT$2,0))","v":"Y"},{"$f":"IF(INDEX(Variables!$1:$1048576,MATCH(F167,Variables!$E:$E,0),MATCH(Cover!$C$14,Variables!$2:$2,0))=\"-\",\"N\",\"Y\")","v":"Y"},{"$f":" CONCATENATE(\"replace proptax = \",G167)","v":"replace proptax = prop_tax1_1968"},{"$f":"AND(H167=\"Y\",I167=\"Y\")","v":true}]
[null,{"$f":"IF(K167,J167,\"* Property tax data not included\")","v":"replace proptax = prop_tax1_1968"}]
[null,"if `INCLUDE_PROP_TAX' == 0 {"]
[null,"     replace proptax = 0"]
[null,"}"]
[]
[null,"*** Set Childcare Expenses",null,null,"PSID Name","Variable Name","Full Name","Included?","This Year?","Code","Use?"]
[null,"gen childcare = 0",null,"Use First","COST CHILD CARE",{"$f":"INDEX(Variables!$B$2:$AT$45,MATCH($E174,Variables!$H$2:$H$45,0),MATCH(\"Variable Name\",Variables!$B$2:$AT$2,0))","v":"childcare1"},{"$f":"CONCATENATE(F174,\"_\",Cover!$C$14)","v":"childcare1_1968"},{"$f":"INDEX(Variables!$B$2:$AT$45,MATCH($E174,Variables!$H$2:$H$45,0),MATCH(\"Included?\",Variables!$B$2:$AT$2,0))","v":"Y"},{"$f":"IF(INDEX(Variables!$1:$1048576,MATCH(F174,Variables!$E:$E,0),MATCH(Cover!$C$14,Variables!$2:$2,0))=\"-\",\"N\",\"Y\")","v":"N"},{"$f":" CONCATENATE(\"replace childcare = \",G174)","v":"replace childcare = childcare1_1968"},{"$f":"AND(H174=\"Y\",I174=\"Y\")","v":false}]
[null,{"$f":"IF(K174,J174,\"* Childcare expense data not included\")","v":"* Childcare expense data not included"}]
[]
[null,"*** Additional notes"]
[null,"* Mortgage interest, short-term capital gains, and long-term capital gains not calculated"]
[]
[null,"*** Run TAXSIM"]
[null,{"$f":"CONCATENATE(\"taxsim9, replace\",IF(Cover!$C$21=\"YES\",\" full\",\"\"))","v":"taxsim9, replace full"}]
[null,"replace year = year + 1"]

{"sheet":"Inputs>","index":7,"n_rows":0,"n_cols":0,"rows_kept":0,"cut":false,"hidden":false,"merged":[]}

{"sheet":"Time Units","index":8,"n_rows":22,"n_cols":11,"rows_kept":22,"cut":false,"hidden":false,"merged":[]}
[]
[null,"PSID Name","Data Year","Description","Hour","Day","Week","2 Wks","Month","Year","Inap"]
[null,null,null,"Multiplier",".",".",".",26,12,1,0]
[null,null,null,"All Variable Codes 1996-2011",null,null,3,4,5,6,0]
[null,"CHILD CARE COST PER",1993,{"$f":"CONCATENATE(OFFSET(Variables!$E$2,MATCH('Time Units'!B5,Variables!$H$3:$H$45,0),0),\"_\",C5)","v":"childcare1_TU_1993"},1,2,3,4,5,6,0]
[null,"CHILD CARE COST PER",1994,{"$f":"CONCATENATE(OFFSET(Variables!$E$2,MATCH('Time Units'!B6,Variables!$H$3:$H$45,0),0),\"_\",C6)","v":"childcare1_TU_1994"},null,null,1,2,3,4,0]
[null,"CHILD CARE COST PER",1995,{"$f":"CONCATENATE(OFFSET(Variables!$E$2,MATCH('Time Units'!B7,Variables!$H$3:$H$45,0),0),\"_\",C7)","v":"childcare1_TU_1995"},null,null,1,2,3,4,0]
[null,"TIME UNIT-WF RPRTD PENSION/ANNUITY",1993,{"$f":"CONCATENATE(OFFSET(Variables!$E$2,MATCH('Time Units'!B8,Variables!$H$3:$H$45,0),0),\"_\",C8)","v":"pension_inc6_TU_1993"},1,2,3,4,5,6,0]
[null,"TIME UNIT-WF RPRTD PENSION/ANNUITY",1994,{"$f":"CONCATENATE(OFFSET(Variables!$E$2,MATCH('Time Units'!B9,Variables!$H$3:$H$45,0),0),\"_\",C9)","v":"pension_inc6_TU_1994"},null,null,1,2,3,4,0]
[null,"TIME UNIT-WF RPRTD PENSION/ANNUITY",1995,{"$f":"CONCATENATE(OFFSET(Variables!$E$2,MATCH('Time Units'!B10,Variables!$H$3:$H$45,0),0),\"_\",C10)","v":"pension_inc6_TU_1995"},null,null,1,2,3,4,0]
[null,"TIME UNIT-HD RPRTD ANNUITIES/IRAS",1993,{"$f":"CONCATENATE(OFFSET(Variables!$E$2,MATCH('Time Units'!B11,Variables!$H$3:$H$45,0),0),\"_\",C11)","v":"pension_inc8_TU_1993"},1,2,3,4,5,6,0]
[null,"TIME UNIT-HD RPRTD ANNUITIES/IRAS",1994,{"$f":"CONCATENATE(OFFSET(Variables!$E$2,MATCH('Time Units'!B12,Variables!$H$3:$H$45,0),0),\"_\",C12)","v":"pension_inc8_TU_1994"},null,null,null,null,1,4,0]
[null,"TIME UNIT-HD RPRTD ANNUITIES/IRAS",1995,{"$f":"CONCATENATE(OFFSET(Variables!$E$2,MATCH('Time Units'!B13,Variables!$H$3:$H$45,0),0),\"_\",C13)","v":"pension_inc8_TU_1995"},null,null,null,null,1,4,0]
[null,"DOLLARS PER WHAT",1993,{"$f":"CONCATENATE(OFFSET(Variables!$E$2,MATCH('Time Units'!B14,Variables!$H$3:$H$45,0),0),\"_\",C14)","v":"rent2_TU_1993"},null,null,null,null,5]
[null,"DOLLARS PER WHAT",1994,{"$f":"CONCATENATE(OFFSET(Variables!$E$2,MATCH('Time Units'!B15,Variables!$H$3:$H$45,0),0),\"_\",C15)","v":"rent2_TU_1994"},null,null,null,null,1]
[null,"DOLLARS PER WHAT",1995,{"$f":"CONCATENATE(OFFSET(Variables!$E$2,MATCH('Time Units'!B16,Variables!$H$3:$H$45,0),0),\"_\",C16)","v":"rent2_TU_1995"},null,null,null,null,"1, 5"]
[null,"TIME UNIT-HD RPRTD UNEMPL COMP",1993,{"$f":"CONCATENATE(OFFSET(Variables!$E$2,MATCH('Time Units'!B17,Variables!$H$3:$H$45,0),0),\"_\",C17)","v":"unemp_inc4_TU_1993"},1,2,3,4,5,6,0]
[null,"TIME UNIT-HD RPRTD UNEMPL COMP",1994,{"$f":"CONCATENATE(OFFSET(Variables!$E$2,MATCH('Time Units'!B18,Variables!$H$3:$H$45,0),0),\"_\",C18)","v":"unemp_inc4_TU_1994"},null,null,1,2,3,4,0]
[null,"TIME UNIT-HD RPRTD UNEMPL COMP",1995,{"$f":"CONCATENATE(OFFSET(Variables!$E$2,MATCH('Time Units'!B19,Variables!$H$3:$H$45,0),0),\"_\",C19)","v":"unemp_inc4_TU_1995"},null,null,1,2,3,4,0]
[null,"TIME UNIT-WF REPORTED UNEMP COMP",1993,{"$f":"CONCATENATE(OFFSET(Variables!$E$2,MATCH('Time Units'!B20,Variables!$H$3:$H$45,0),0),\"_\",C20)","v":"unemp_inc6_TU_1993"},1,2,3,4,5,6,0]
[null,"TIME UNIT-WF REPORTED UNEMP COMP",1994,{"$f":"CONCATENATE(OFFSET(Variables!$E$2,MATCH('Time Units'!B21,Variables!$H$3:$H$45,0),0),\"_\",C21)","v":"unemp_inc6_TU_1994"},null,null,1,2,3,4,0]
[null,"TIME UNIT-WF REPORTED UNEMP COMP",1995,{"$f":"CONCATENATE(OFFSET(Variables!$E$2,MATCH('Time Units'!B22,Variables!$H$3:$H$45,0),0),\"_\",C22)","v":"unemp_inc6_TU_1995"},null,null,1,2,3,4,0]

{"sheet":"Indicators","index":9,"n_rows":7,"n_cols":10,"rows_kept":7,"cut":false,"hidden":false,"merged":[]}
[]
[]
[]
[null,"PSID Name","Variable Name","Included?","Entry","Code 1","Code 2","Code 3","Code 4","Code 5"]
[null,"J1 MARITAL STATUS",{"$f":"INDEX(Variables!$B$2:$AT$45,MATCH($B5,Variables!$H$2:$H$45,0),MATCH(C$4,Variables!$B$2:$AT$2,0))","v":"mstat1"},{"$f":"OFFSET(Variables!$F$2,MATCH(C5,Variables!$E$3:$E$45,0),0)","v":"Y"},"Original",1,2,3,4,5]
[null,"J1 MARITAL STATUS",{"$f":"INDEX(Variables!$B$2:$AT$45,MATCH($B6,Variables!$H$2:$H$45,0),MATCH(C$4,Variables!$B$2:$AT$2,0))","v":"mstat1"},{"$f":"OFFSET(Variables!$F$2,MATCH(C6,Variables!$E$3:$E$45,0),0)","v":"Y"},"Meaning","Married","Single / Never Married","Widowed","Divorced / Annulled","Separated"]
[null,"J1 MARITAL STATUS",{"$f":"INDEX(Variables!$B$2:$AT$45,MATCH($B7,Variables!$H$2:$H$45,0),MATCH(C$4,Variables!$B$2:$AT$2,0))","v":"mstat1"},{"$f":"OFFSET(Variables!$F$2,MATCH(C7,Variables!$E$3:$E$45,0),0)","v":"Y"},"Replacement",2,1,1,1,2]

{"sheet":"Error Codes","index":10,"n_rows":49,"n_cols":46,"rows_kept":49,"cut":false,"hidden":false,"merged":[]}
[]
[null,"PSID Name","Variable Name","Included?",{"$f":"CONCATENATE(Cover!$C$14,\" Var?\")","v":"1968 Var?"},{"$f":"CONCATENATE(Cover!$C$14,\" Error?\")","v":"1968 Error?"},"Cumulative Count","Category Count","Action",1968,1969,1970,1971,1972,1973,1974,1975,1976,1977,1978,1979,1980,1981,1982,1983,1984,1985,1986,1987,1988,1989,1990,1991,1992,1993,1994,1995,1996,1997,1999,2001,2003,2005,2007,2009,2011]
[null,"AGE OF HEAD",{"$f":"INDEX(Variables!$B$2:$AT$45,MATCH($B3,Variables!$H$2:$H$45,0),MATCH(C$2,Variables!$B$2:$AT$2,0))","v":"age1"},{"$f":"OFFSET(Variables!$F$2,MATCH(C3,Variables!$E$3:$E$45,0),0)","v":"Y"},{"$f":"IF(INDEX(Variables!$B$2:$AT$45,MATCH('Error Codes'!$B3,Variables!$H$2:$H$45,0),MATCH(Survey_Year,Variables!$B$2:$AT$2,0))<>\"-\",\"Y\",\"N\")","v":"Y"},{"$f":"IF(D3=\"N\",0,IF(E3=\"N\",0,IF(OFFSET($I3,0,MATCH(Cover!$C$14,$J$2:$AT$2,0))>0,1,0)))","v":1},{"$f":"COUNTIF($F$3:F3,\">\"&0)","v":1},{"$f":"COUNTIFS($C$3:C3,C3,$F$3:F3,1)","v":1},"Drop",98,null,null,null,null,null,null,null,null,null,null,null,null,null,null,null,null,null,null,null,null,null,null,null,null,null,null,98,98]
[null,"AGE OF HEAD",{"$f":"INDEX(Variables!$B$2:$AT$45,MATCH($B4,Variables!$H$2:$H$45,0),MATCH(C$2,Variables!$B$2:$AT$2,0))","v":"age1"},{"$f":"OFFSET(Variables!$F$2,MATCH(C4,Variables!$E$3:$E$45,0),0)","v":"Y"},{"$f":"IF(INDEX(Variables!$B$2:$AT$45,MATCH('Error Codes'!$B4,Variables!$H$2:$H$45,0),MATCH(Survey_Year,Variables!$B$2:$AT$2,0))<>\"-\",\"Y\",\"N\")","v":"Y"},{"$f":"IF(D4=\"N\",0,IF(E4=\"N\",0,IF(OFFSET($I4,0,MATCH(Cover!$C$14,$J$2:$AT$2,0))>0,1,0)))","v":0},{"$f":"COUNTIF($F$3:F4,\">\"&0)","v":1},{"$f":"COUNTIFS($C$3:C4,C4,$F$3:F4,1)","v":1},"Drop",null,null,null,null,null,null,null,null,null,null,null,null,null,null,null,null,null,null,null,null,null,null,null,null,null,null,0,0,0]
[null,"AGE OF HEAD",{"$f":"INDEX(Variables!$B$2:$AT$45,MATCH($B5,Variables!$H$2:$H$45,0),MATCH(C$2,Variables!$B$2:$AT$2,0))","v":"age1"},{"$f":"OFFSET(Variables!$F$2,MATCH(C5,Variables!$E$3:$E$45,0),0)","v":"Y"},{"$f":"IF(INDEX(Variables!$B$2:$AT$45,MATCH('Error Codes'!$B5,Variables!$H$2:$H$45,0),MATCH(Survey_Year,Variables!$B$2:$AT$2,0))<>\"-\",\"Y\",\"N\")","v":"Y"},{"$f":"IF(D5=\"N\",0,IF(E5=\"N\",0,IF(OFFSET($I5,0,MATCH(Cover!$C$14,$J$2:$AT$2,0))>0,1,0)))","v":1},{"$f":"COUNTIF($F$3:F5,\">\"&0)","v":2},{"$f":"COUNTIFS($C$3:C5,C5,$F$3:F5,1)","v":2},"Drop",99,99,99,99,99,99,99,99,99,99,99,99,99,99,99,99,99,99,99,99,99,99,99,99,99,99,99,99,99,999,999,999,999,999,999,999,999]
[null,"AGE OF WIFE",{"$f":"INDEX(Variables!$B$2:$AT$45,MATCH($B6,Variables!$H$2:$H$45,0),MATCH(C$2,Variables!$B$2:$AT$2,0))","v":"age2"},{"$f":"OFFSET(Variables!$F$2,MATCH(C6,Variables!$E$3:$E$45,0),0)","v":"Y"},{"$f":"IF(INDEX(Variables!$B$2:$AT$45,MATCH('Error Codes'!$B6,Variables!$H$2:$H$45,0),MATCH(Survey_Year,Variables!$B$2:$AT$2,0))<>\"-\",\"Y\",\"N\")","v":"Y"},{"$f":"IF(D6=\"N\",0,IF(E6=\"N\",0,IF(OFFSET($I6,0,MATCH(Cover!$C$14,$J$2:$AT$2,0))>0,1,0)))","v":1},{"$f":"COUNTIF($F$3:F6,\">\"&0)","v":3},{"$f":"COUNTIFS($C$3:C6,C6,$F$3:F6,1)","v":1},"Drop",99,99,99,99,99,99,99,99,99,99,99,99,99,99,99,99,99,99,99,99,99,99,99,99,99,99,99,99,99,999,999,999,999,999,999,999,999]
[null,"DEPENDENTS NOT HERE",{"$f":"INDEX(Variables!$B$2:$AT$45,MATCH($B7,Variables!$H$2:$H$45,0),MATCH(C$2,Variables!$B$2:$AT$2,0))","v":"num_dep3"},{"$f":"OFFSET(Variables!$F$2,MATCH(C7,Variables!$E$3:$E$45,0),0)","v":"Y"},{"$f":"IF(INDEX(Variables!$B$2:$AT$45,MATCH('Error Codes'!$B7,Variables!$H$2:$H$45,0),MATCH(Survey_Year,Variables!$B$2:$AT$2,0))<>\"-\",\"Y\",\"N\")","v":"Y"},{"$f":"IF(D7=\"N\",0,IF(E7=\"N\",0,IF(OFFSET($I7,0,MATCH(Cover!$C$14,$J$2:$AT$2,0))>0,1,0)))","v":1},{"$f":"COUNTIF($F$3:F7,\">\"&0)","v":4},{"$f":"COUNTIFS($C$3:C7,C7,$F$3:F7,1)","v":1},"Replace with 0",9,9,9,9,9,9,9,9,9,9,9,9,9,9,9,9,9,9,9,9,9,9,9,9,9,9]
[null,"HDS LABOR INCOME",{"$f":"INDEX(Variables!$B$2:$AT$45,MATCH($B8,Variables!$H$2:$H$45,0),MATCH(C$2,Variables!$B$2:$AT$2,0))","v":"wages1"},{"$f":"OFFSET(Variables!$F$2,MATCH(C8,Variables!$E$3:$E$45,0),0)","v":"Y"},{"$f":"IF(INDEX(Variables!$B$2:$AT$45,MATCH('Error Codes'!$B8,Variables!$H$2:$H$45,0),MATCH(Survey_Year,Variables!$B$2:$AT$2,0))<>\"-\",\"Y\",\"N\")","v":"Y"},{"$f":"IF(D8=\"N\",0,IF(E8=\"N\",0,IF(OFFSET($I8,0,MATCH(Cover!$C$14,$J$2:$AT$2,0))>0,1,0)))","v":0},{"$f":"COUNTIF($F$3:F8,\">\"&0)","v":4},{"$f":"COUNTIFS($C$3:C8,C8,$F$3:F8,1)","v":0},"Drop",null,null,null,null,null,null,null,null,null,null,null,null,null,null,null,null,null,null,null,null,null,null,null,null,null,null,9999999,9999999]
[null,"LABOR INCOME OF WIFE",{"$f":"INDEX(Variables!$B$2:$AT$45,MATCH($B9,Variables!$H$2:$H$45,0),MATCH(C$2,Variables!$B$2:$AT$2,0))","v":"wages3"},{"$f":"OFFSET(Variables!$F$2,MATCH(C9,Variables!$E$3:$E$45,0),0)","v":"Y"},{"$f":"IF(INDEX(Variables!$B$2:$AT$45,MATCH('Error Codes'!$B9,Variables!$H$2:$H$45,0),MATCH(Survey_Year,Variables!$B$2:$AT$2,0))<>\"-\",\"Y\",\"N\")","v":"N"},{"$f":"IF(D9=\"N\",0,IF(E9=\"N\",0,IF(OFFSET($I9,0,MATCH(Cover!$C$14,$J$2:$AT$2,0))>0,1,0)))","v":0},{"$f":"COUNTIF($F$3:F9,\">\"&0)","v":4},{"$f":"COUNTIFS($C$3:C9,C9,$F$3:F9,1)","v":0},"Drop",null,null,null,null,null,null,null,null,null,null,null,null,null,null,null,null,null,null,null,null,null,null,null,null,null,null,9999999,9999999]
[null,"WF LABOR PART OF YR-1 BUSINESS INCOME",{"$f":"INDEX(Variables!$B$2:$AT$45,MATCH($B10,Variables!$H$2:$H$45,0),MATCH(C$2,Variables!$B$2:$AT$2,0))","v":"wages4"},{"$f":"OFFSET(Variables!$F$2,MATCH(C10,Variables!$E$3:$E$45,0),0)","v":"Y"},{"$f":"IF(INDEX(Variables!$B$2:$AT$45,MATCH('Error Codes'!$B10,Variables!$H$2:$H$45,0),MATCH(Survey_Year,Variables!$B$2:$AT$2,0))<>\"-\",\"Y\",\"N\")","v":"N"},{"$f":"IF(D10=\"N\",0,IF(E10=\"N\",0,IF(OFFSET($I10,0,MATCH(Cover!$C$14,$J$2:$AT$2,0))>0,1,0)))","v":0},{"$f":"COUNTIF($F$3:F10,\">\"&0)","v":4},{"$f":"COUNTIFS($C$3:C10,C10,$F$3:F10,1)","v":0},"Drop",null,null,null,null,null,null,null,null,null,null,null,null,null,null,null,null,null,null,null,null,null,null,null,null,null,null,999999,999999,null,999999]
[null,"MARITAL STATUS",{"$f":"INDEX(Variables!$B$2:$AT$45,MATCH($B11,Variables!$H$2:$H$45,0),MATCH(C$2,Variables!$B$2:$AT$2,0))","v":"mstat2"},{"$f":"OFFSET(Variables!$F$2,MATCH(C11,Variables!$E$3:$E$45,0),0)","v":"Y"},{"$f":"IF(INDEX(Variables!$B$2:$AT$45,MATCH('Error Codes'!$B11,Variables!$H$2:$H$45,0),MATCH(Survey_Year,Variables!$B$2:$AT$2,0))<>\"-\",\"Y\",\"N\")","v":"Y"},{"$f":"IF(D11=\"N\",0,IF(E11=\"N\",0,IF(OFFSET($I11,0,MATCH(Cover!$C$14,$J$2:$AT$2,0))>0,1,0)))","v":1},{"$f":"COUNTIF($F$3:F11,\">\"&0)","v":5},{"$f":"COUNTIFS($C$3:C11,C11,$F$3:F11,1)","v":1},"Drop",9,null,null,null,null,null,null,null,null,null,null,null,null,null,9,9,9,9,9,9,9,9,9,9,9,9,9,9,9,9,9,9,9,9,9,9,9]
[null,"J1 MARITAL STATUS",{"$f":"INDEX(Variables!$B$2:$AT$45,MATCH($B12,Variables!$H$2:$H$45,0),MATCH(C$2,Variables!$B$2:$AT$2,0))","v":"mstat1"},{"$f":"OFFSET(Variables!$F$2,MATCH(C12,Variables!$E$3:$E$45,0),0)","v":"Y"},{"$f":"IF(INDEX(Variables!$B$2:$AT$45,MATCH('Error Codes'!$B12,Variables!$H$2:$H$45,0),MATCH(Survey_Year,Variables!$B$2:$AT$2,0))<>\"-\",\"Y\",\"N\")","v":"N"},{"$f":"IF(D12=\"N\",0,IF(E12=\"N\",0,IF(OFFSET($I12,0,MATCH(Cover!$C$14,$J$2:$AT$2,0))>0,1,0)))","v":0},{"$f":"COUNTIF($F$3:F12,\">\"&0)","v":5},{"$f":"COUNTIFS($C$3:C12,C12,$F$3:F12,1)","v":0},"Drop",null,null,null,null,null,null,null,null,null,null,null,null,null,null,9,9,9,9,9,9,9,9,9,9,9,9,9,9,9,9,8,9,9,9,9,9,9]
[null,"J1 MARITAL STATUS",{"$f":"INDEX(Variables!$B$2:$AT$45,MATCH($B13,Variables!$H$2:$H$45,0),MATCH(C$2,Variables!$B$2:$AT$2,0))","v":"mstat1"},{"$f":"OFFSET(Variables!$F$2,MATCH(C13,Variables!$E$3:$E$45,0),0)","v":"Y"},{"$f":"IF(INDEX(Variables!$B$2:$AT$45,MATCH('Error Codes'!$B13,Variables!$H$2:$H$45,0),MATCH(Survey_Year,Variables!$B$2:$AT$2,0))<>\"-\",\"Y\",\"N\")","v":"N"},{"$f":"IF(D13=\"N\",0,IF(E13=\"N\",0,IF(OFFSET($I13,0,MATCH(Cover!$C$14,$J$2:$AT$2,0))>0,1,0)))","v":0},{"$f":"COUNTIF($F$3:F13,\">\"&0)","v":5},{"$f":"COUNTIFS($C$3:C13,C13,$F$3:F13,1)","v":0},"Drop",null,null,null,null,null,null,null,null,null,null,null,null,null,null,null,null,null,null,null,null,null,null,null,null,null,null,"8, 0","8, 0","8, 0",null,8,8,8,8,8,8,8]
[null,"STATE NOW",{"$f":"INDEX(Variables!$B$2:$AT$45,MATCH($B14,Variables!$H$2:$H$45,0),MATCH(C$2,Variables!$B$2:$AT$2,0))","v":"state1"},{"$f":"OFFSET(Variables!$F$2,MATCH(C14,Variables!$E$3:$E$45,0),0)","v":"Y"},{"$f":"IF(INDEX(Variables!$B$2:$AT$45,MATCH('Error Codes'!$B14,Variables!$H$2:$H$45,0),MATCH(Survey_Year,Variables!$B$2:$AT$2,0))<>\"-\",\"Y\",\"N\")","v":"Y"},{"$f":"IF(D14=\"N\",0,IF(E14=\"N\",0,IF(OFFSET($I14,0,MATCH(Cover!$C$14,$J$2:$AT$2,0))>0,1,0)))","v":1},{"$f":"COUNTIF($F$3:F14,\">\"&0)","v":6},{"$f":"COUNTIFS($C$3:C14,C14,$F$3:F14,1)","v":1},"Drop",99,99,99,99,99,99,99,99,99,99,99,99,99,99,99,99,99,99,99,99,99,99,99,99,99,99,99,99,99,99,99,99,99,99,99,99,99]
[null,"STATE NOW",{"$f":"INDEX(Variables!$B$2:$AT$45,MATCH($B15,Variables!$H$2:$H$45,0),MATCH(C$2,Variables!$B$2:$AT$2,0))","v":"state1"},{"$f":"OFFSET(Variables!$F$2,MATCH(C15,Variables!$E$3:$E$45,0),0)","v":"Y"},{"$f":"IF(INDEX(Variables!$B$2:$AT$45,MATCH('Error Codes'!$B15,Variables!$H$2:$H$45,0),MATCH(Survey_Year,Variables!$B$2:$AT$2,0))<>\"-\",\"Y\",\"N\")","v":"Y"},{"$f":"IF(D15=\"N\",0,IF(E15=\"N\",0,IF(OFFSET($I15,0,MATCH(Cover!$C$14,$J$2:$AT$2,0))>0,1,0)))","v":0},{"$f":"COUNTIF($F$3:F15,\">\"&0)","v":6},{"$f":"COUNTIFS($C$3:C15,C15,$F$3:F15,1)","v":1},"Drop",0,0,0,0,0,0,0,0,0,0,0,0,0,0,0,0,0,0,0,0,0,0,0,0,0,0,0,0,0,0,0,0,0,0,0,0,0]
[null,"COST CHILD CARE",{"$f":"INDEX(Variables!$B$2:$AT$45,MATCH($B16,Variables!$H$2:$H$45,0),MATCH(C$2,Variables!$B$2:$AT$2,0))","v":"childcare1"},{"$f":"OFFSET(Variables!$F$2,MATCH(C16,Variables!$E$3:$E$45,0),0)","v":"Y"},{"$f":"IF(INDEX(Variables!$B$2:$AT$45,MATCH('Error Codes'!$B16,Variables!$H$2:$H$45,0),MATCH(Survey_Year,Variables!$B$2:$AT$2,0))<>\"-\",\"Y\",\"N\")","v":"N"},{"$f":"IF(D16=\"N\",0,IF(E16=\"N\",0,IF(OFFSET($I16,0,MATCH(Cover!$C$14,$J$2:$AT$2,0))>0,1,0)))","v":0},{"$f":"COUNTIF($F$3:F16,\">\"&0)","v":6},{"$f":"COUNTIFS($C$3:C16,C16,$F$3:F16,1)","v":0},"Replace with 0",null,null,null,null,null,null,null,null,null,null,null,null,null,null,null,null,null,99999,null,null,99999,99999,99999,99999,99999,99999,99999,99999,99999,99999,999999,999999,999999,999999,999999,999999,999999]
[null,"COST CHILD CARE",{"$f":"INDEX(Variables!$B$2:$AT$45,MATCH($B17,Variables!$H$2:$H$45,0),MATCH(C$2,Variables!$B$2:$AT$2,0))","v":"childcare1"},{"$f":"OFFSET(Variables!$F$2,MATCH(C17,Variables!$E$3:$E$45,0),0)","v":"Y"},{"$f":"IF(INDEX(Variables!$B$2:$AT$45,MATCH('Error Codes'!$B17,Variables!$H$2:$H$45,0),MATCH(Survey_Year,Variables!$B$2:$AT$2,0))<>\"-\",\"Y\",\"N\")","v":"N"},{"$f":"IF(D17=\"N\",0,IF(E17=\"N\",0,IF(OFFSET($I17,0,MATCH(Cover!$C$14,$J$2:$AT$2,0))>0,1,0)))","v":0},{"$f":"COUNTIF($F$3:F17,\">\"&0)","v":6},{"$f":"COUNTIFS($C$3:C17,C17,$F$3:F17,1)","v":0},"Replace with 0",null,null,null,null,null,null,null,null,null,null,null,null,null,null,null,null,null,null,null,null,null,null,null,null,null,null,99998,99998,99998,99998,999998,999998,999998,999998,999998,999998,999998]
[null,"H+W TAXABLE INC",{"$f":"INDEX(Variables!$B$2:$AT$45,MATCH($B18,Variables!$H$2:$H$45,0),MATCH(C$2,Variables!$B$2:$AT$2,0))","v":"tax_inc1"},{"$f":"OFFSET(Variables!$F$2,MATCH(C18,Variables!$E$3:$E$45,0),0)","v":"Y"},{"$f":"IF(INDEX(Variables!$B$2:$AT$45,MATCH('Error Codes'!$B18,Variables!$H$2:$H$45,0),MATCH(Survey_Year,Variables!$B$2:$AT$2,0))<>\"-\",\"Y\",\"N\")","v":"Y"},{"$f":"IF(D18=\"N\",0,IF(E18=\"N\",0,IF(OFFSET($I18,0,MATCH(Cover!$C$14,$J$2:$AT$2,0))>0,1,0)))","v":0},{"$f":"COUNTIF($F$3:F18,\">\"&0)","v":6},{"$f":"COUNTIFS($C$3:C18,C18,$F$3:F18,1)","v":0},"Drop",null,null,null,null,null,null,null,null,null,null,null,null,null,null,null,null,null,null,null,null,null,null,null,null,null,null,9999999,9999999]
[null,"WF REPRTD PENSION/ANNUITY INCOME",{"$f":"INDEX(Variables!$B$2:$AT$45,MATCH($B19,Variables!$H$2:$H$45,0),MATCH(C$2,Variables!$B$2:$AT$2,0))","v":"pension_inc6"},{"$f":"OFFSET(Variables!$F$2,MATCH(C19,Variables!$E$3:$E$45,0),0)","v":"Y"},{"$f":"IF(INDEX(Variables!$B$2:$AT$45,MATCH('Error Codes'!$B19,Variables!$H$2:$H$45,0),MATCH(Survey_Year,Variables!$B$2:$AT$2,0))<>\"-\",\"Y\",\"N\")","v":"N"},{"$f":"IF(D19=\"N\",0,IF(E19=\"N\",0,IF(OFFSET($I19,0,MATCH(Cover!$C$14,$J$2:$AT$2,0))>0,1,0)))","v":0},{"$f":"COUNTIF($F$3:F19,\">\"&0)","v":6},{"$f":"COUNTIFS($C$3:C19,C19,$F$3:F19,1)","v":0},"Drop",null,null,null,null,null,null,null,null,null,null,null,null,null,null,null,null,null,null,null,null,null,null,null,null,null,99999,99999,99999,99999,99999,99999,99999,999999,999999,999999,999999,999999]
[null,"WF REPRTD PENSION/ANNUITY INCOME",{"$f":"INDEX(Variables!$B$2:$AT$45,MATCH($B20,Variables!$H$2:$H$45,0),MATCH(C$2,Variables!$B$2:$AT$2,0))","v":"pension_inc6"},{"$f":"OFFSET(Variables!$F$2,MATCH(C20,Variables!$E$3:$E$45,0),0)","v":"Y"},{"$f":"IF(INDEX(Variables!$B$2:$AT$45,MATCH('Error Codes'!$B20,Variables!$H$2:$H$45,0),MATCH(Survey_Year,Variables!$B$2:$AT$2,0))<>\"-\",\"Y\",\"N\")","v":"N"},{"$f":"IF(D20=\"N\",0,IF(E20=\"N\",0,IF(OFFSET($I20,0,MATCH(Cover!$C$14,$J$2:$AT$2,0))>0,1,0)))","v":0},{"$f":"COUNTIF($F$3:F20,\">\"&0)","v":6},{"$f":"COUNTIFS($C$3:C20,C20,$F$3:F20,1)","v":0},"Drop",null,null,null,null,null,null,null,null,null,null,null,null,null,null,null,null,null,null,null,null,null,null,null,null,null,null,99998,99998,99998,99998,99998,99998,999998,999998,999998,999998,999998]
[null,"HD REPORTED ANNUITY/IRA INCOME",{"$f":"INDEX(Variables!$B$2:$AT$45,MATCH($B21,Variables!$H$2:$H$45,0),MATCH(C$2,Variables!$B$2:$AT$2,0))","v":"pension_inc8"},{"$f":"OFFSET(Variables!$F$2,MATCH(C21,Variables!$E$3:$E$45,0),0)","v":"Y"},{"$f":"IF(INDEX(Variables!$B$2:$AT$45,MATCH('Error Codes'!$B21,Variables!$H$2:$H$45,0),MATCH(Survey_Year,Variables!$B$2:$AT$2,0))<>\"-\",\"Y\",\"N\")","v":"N"},{"$f":"IF(D21=\"N\",0,IF(E21=\"N\",0,IF(OFFSET($I21,0,MATCH(Cover!$C$14,$J$2:$AT$2,0))>0,1,0)))","v":0},{"$f":"COUNTIF($F$3:F21,\">\"&0)","v":6},{"$f":"COUNTIFS($C$3:C21,C21,$F$3:F21,1)","v":0},"Drop",null,null,null,null,null,null,null,null,null,null,null,null,null,null,null,null,null,null,null,null,null,null,null,null,null,99999,999999,999999,999999,999999,999999,999999,999999,999999,999999,999999,999999]
[null,"HD REPORTED ANNUITY/IRA INCOME",{"$f":"INDEX(Variables!$B$2:$AT$45,MATCH($B22,Variables!$H$2:$H$45,0),MATCH(C$2,Variables!$B$2:$AT$2,0))","v":"pension_inc8"},{"$f":"OFFSET(Variables!$F$2,MATCH(C22,Variables!$E$3:$E$45,0),0)","v":"Y"},{"$f":"IF(INDEX(Variables!$B$2:$AT$45,MATCH('Error Codes'!$B22,Variables!$H$2:$H$45,0),MATCH(Survey_Year,Variables!$B$2:$AT$2,0))<>\"-\",\"Y\",\"N\")","v":"N"},{"$f":"IF(D22=\"N\",0,IF(E22=\"N\",0,IF(OFFSET($I22,0,MATCH(Cover!$C$14,$J$2:$AT$2,0))>0,1,0)))","v":0},{"$f":"COUNTIF($F$3:F22,\">\"&0)","v":6},{"$f":"COUNTIFS($C$3:C22,C22,$F$3:F22,1)","v":0},"Drop",null,null,null,null,null,null,null,null,null,null,null,null,null,null,null,null,null,null,null,null,null,null,null,null,null,null,999998,999998,999998,999998,999998,999998,999998,999998,999998,999998,999998]
[null,"TIME UNIT-WF RPRTD PENSION/ANNUITY",{"$f":"INDEX(Variables!$B$2:$AT$45,MATCH($B23,Variables!$H$2:$H$45,0),MATCH(C$2,Variables!$B$2:$AT$2,0))","v":"pension_inc6_TU"},{"$f":"OFFSET(Variables!$F$2,MATCH(C23,Variables!$E$3:$E$45,0),0)","v":"Y"},{"$f":"IF(INDEX(Variables!$B$2:$AT$45,MATCH('Error Codes'!$B23,Variables!$H$2:$H$45,0),MATCH(Survey_Year,Variables!$B$2:$AT$2,0))<>\"-\",\"Y\",\"N\")","v":"N"},{"$f":"IF(D23=\"N\",0,IF(E23=\"N\",0,IF(OFFSET($I23,0,MATCH(Cover!$C$14,$J$2:$AT$2,0))>0,1,0)))","v":0},{"$f":"COUNTIF($F$3:F23,\">\"&0)","v":6},{"$f":"COUNTIFS($C$3:C23,C23,$F$3:F23,1)","v":0},"Drop",null,null,null,null,null,null,null,null,null,null,null,null,null,null,null,null,null,null,null,null,null,null,null,null,null,9,9,9,9,9,9,9,9,9,9,9,9]
[null,"TIME UNIT-WF RPRTD PENSION/ANNUITY",{"$f":"INDEX(Variables!$B$2:$AT$45,MATCH($B24,Variables!$H$2:$H$45,0),MATCH(C$2,Variables!$B$2:$AT$2,0))","v":"pension_inc6_TU"},{"$f":"OFFSET(Variables!$F$2,MATCH(C24,Variables!$E$3:$E$45,0),0)","v":"Y"},{"$f":"IF(INDEX(Variables!$B$2:$AT$45,MATCH('Error Codes'!$B24,Variables!$H$2:$H$45,0),MATCH(Survey_Year,Variables!$B$2:$AT$2,0))<>\"-\",\"Y\",\"N\")","v":"N"},{"$f":"IF(D24=\"N\",0,IF(E24=\"N\",0,IF(OFFSET($I24,0,MATCH(Cover!$C$14,$J$2:$AT$2,0))>0,1,0)))","v":0},{"$f":"COUNTIF($F$3:F24,\">\"&0)","v":6},{"$f":"COUNTIFS($C$3:C24,C24,$F$3:F24,1)","v":0},"Drop",null,null,null,null,null,null,null,null,null,null,null,null,null,null,null,null,null,null,null,null,null,null,null,null,null,7,8,8,8,8,8,8,8,8,8,8,8]
[null,"TIME UNIT-WF RPRTD PENSION/ANNUITY",{"$f":"INDEX(Variables!$B$2:$AT$45,MATCH($B25,Variables!$H$2:$H$45,0),MATCH(C$2,Variables!$B$2:$AT$2,0))","v":"pension_inc6_TU"},{"$f":"OFFSET(Variables!$F$2,MATCH(C25,Variables!$E$3:$E$45,0),0)","v":"Y"},{"$f":"IF(INDEX(Variables!$B$2:$AT$45,MATCH('Error Codes'!$B25,Variables!$H$2:$H$45,0),MATCH(Survey_Year,Variables!$B$2:$AT$2,0))<>\"-\",\"Y\",\"N\")","v":"N"},{"$f":"IF(D25=\"N\",0,IF(E25=\"N\",0,IF(OFFSET($I25,0,MATCH(Cover!$C$14,$J$2:$AT$2,0))>0,1,0)))","v":0},{"$f":"COUNTIF($F$3:F25,\">\"&0)","v":6},{"$f":"COUNTIFS($C$3:C25,C25,$F$3:F25,1)","v":0},"Drop",null,null,null,null,null,null,null,null,null,null,null,null,null,null,null,null,null,null,null,null,null,null,null,null,null,null,null,5,7,7,7,7,7,7,7,7,7]
[null,"TIME UNIT-HD RPRTD ANNUITIES/IRAS",{"$f":"INDEX(Variables!$B$2:$AT$45,MATCH($B26,Variables!$H$2:$H$45,0),MATCH(C$2,Variables!$B$2:$AT$2,0))","v":"pension_inc8_TU"},{"$f":"OFFSET(Variables!$F$2,MATCH(C26,Variables!$E$3:$E$45,0),0)","v":"Y"},{"$f":"IF(INDEX(Variables!$B$2:$AT$45,MATCH('Error Codes'!$B26,Variables!$H$2:$H$45,0),MATCH(Survey_Year,Variables!$B$2:$AT$2,0))<>\"-\",\"Y\",\"N\")","v":"N"},{"$f":"IF(D26=\"N\",0,IF(E26=\"N\",0,IF(OFFSET($I26,0,MATCH(Cover!$C$14,$J$2:$AT$2,0))>0,1,0)))","v":0},{"$f":"COUNTIF($F$3:F26,\">\"&0)","v":6},{"$f":"COUNTIFS($C$3:C26,C26,$F$3:F26,1)","v":0},"Drop",null,null,null,null,null,null,null,null,null,null,null,null,null,null,null,null,null,null,null,null,null,null,null,null,null,9,9,9,9,9,9,9,9,9,9,9,9]
[null,"TIME UNIT-HD RPRTD ANNUITIES/IRAS",{"$f":"INDEX(Variables!$B$2:$AT$45,MATCH($B27,Variables!$H$2:$H$45,0),MATCH(C$2,Variables!$B$2:$AT$2,0))","v":"pension_inc8_TU"},{"$f":"OFFSET(Variables!$F$2,MATCH(C27,Variables!$E$3:$E$45,0),0)","v":"Y"},{"$f":"IF(INDEX(Variables!$B$2:$AT$45,MATCH('Error Codes'!$B27,Variables!$H$2:$H$45,0),MATCH(Survey_Year,Variables!$B$2:$AT$2,0))<>\"-\",\"Y\",\"N\")","v":"N"},{"$f":"IF(D27=\"N\",0,IF(E27=\"N\",0,IF(OFFSET($I27,0,MATCH(Cover!$C$14,$J$2:$AT$2,0))>0,1,0)))","v":0},{"$f":"COUNTIF($F$3:F27,\">\"&0)","v":6},{"$f":"COUNTIFS($C$3:C27,C27,$F$3:F27,1)","v":0},"Drop",null,null,null,null,null,null,null,null,null,null,null,null,null,null,null,null,null,null,null,null,null,null,null,null,null,7,8,8,8,8,8,8,8,8,8,8,8]
[null,"TIME UNIT-HD RPRTD ANNUITIES/IRAS",{"$f":"INDEX(Variables!$B$2:$AT$45,MATCH($B28,Variables!$H$2:$H$45,0),MATCH(C$2,Variables!$B$2:$AT$2,0))","v":"pension_inc8_TU"},{"$f":"OFFSET(Variables!$F$2,MATCH(C28,Variables!$E$3:$E$45,0),0)","v":"Y"},{"$f":"IF(INDEX(Variables!$B$2:$AT$45,MATCH('Error Codes'!$B28,Variables!$H$2:$H$45,0),MATCH(Survey_Year,Variables!$B$2:$AT$2,0))<>\"-\",\"Y\",\"N\")","v":"N"},{"$f":"IF(D28=\"N\",0,IF(E28=\"N\",0,IF(OFFSET($I28,0,MATCH(Cover!$C$14,$J$2:$AT$2,0))>0,1,0)))","v":0},{"$f":"COUNTIF($F$3:F28,\">\"&0)","v":6},{"$f":"COUNTIFS($C$3:C28,C28,$F$3:F28,1)","v":0},"Drop",null,null,null,null,null,null,null,null,null,null,null,null,null,null,null,null,null,null,null,null,null,null,null,null,null,null,5,5,7,7,7,7,7,7,7,7,7]
[null,"TRANSFER Y H+W",{"$f":"INDEX(Variables!$B$2:$AT$45,MATCH($B29,Variables!$H$2:$H$45,0),MATCH(C$2,Variables!$B$2:$AT$2,0))","v":"transfers1"},{"$f":"OFFSET(Variables!$F$2,MATCH(C29,Variables!$E$3:$E$45,0),0)","v":"Y"},{"$f":"IF(INDEX(Variables!$B$2:$AT$45,MATCH('Error Codes'!$B29,Variables!$H$2:$H$45,0),MATCH(Survey_Year,Variables!$B$2:$AT$2,0))<>\"-\",\"Y\",\"N\")","v":"N"},{"$f":"IF(D29=\"N\",0,IF(E29=\"N\",0,IF(OFFSET($I29,0,MATCH(Cover!$C$14,$J$2:$AT$2,0))>0,1,0)))","v":0},{"$f":"COUNTIF($F$3:F29,\">\"&0)","v":6},{"$f":"COUNTIFS($C$3:C29,C29,$F$3:F29,1)","v":0},"Drop",null,null,null,null,null,null,null,null,null,null,null,null,null,null,null,null,null,null,null,null,null,null,null,null,null,null,9999999,9999999]
[null,"HD REPORTED UNEMPL COMP INCOME",{"$f":"INDEX(Variables!$B$2:$AT$45,MATCH($B30,Variables!$H$2:$H$45,0),MATCH(C$2,Variables!$B$2:$AT$2,0))","v":"unemp_inc4"},{"$f":"OFFSET(Variables!$F$2,MATCH(C30,Variables!$E$3:$E$45,0),0)","v":"Y"},{"$f":"IF(INDEX(Variables!$B$2:$AT$45,MATCH('Error Codes'!$B30,Variables!$H$2:$H$45,0),MATCH(Survey_Year,Variables!$B$2:$AT$2,0))<>\"-\",\"Y\",\"N\")","v":"N"},{"$f":"IF(D30=\"N\",0,IF(E30=\"N\",0,IF(OFFSET($I30,0,MATCH(Cover!$C$14,$J$2:$AT$2,0))>0,1,0)))","v":0},{"$f":"COUNTIF($F$3:F30,\">\"&0)","v":6},{"$f":"COUNTIFS($C$3:C30,C30,$F$3:F30,1)","v":0},"Replace with 0",null,null,null,null,null,null,null,null,null,null,null,null,null,null,null,null,null,null,null,null,null,null,null,null,null,99999,99999,99999,99999,99999,99999,99999,999999,999999,999999,999999,999999]
[null,"HD REPORTED UNEMPL COMP INCOME",{"$f":"INDEX(Variables!$B$2:$AT$45,MATCH($B31,Variables!$H$2:$H$45,0),MATCH(C$2,Variables!$B$2:$AT$2,0))","v":"unemp_inc4"},{"$f":"OFFSET(Variables!$F$2,MATCH(C31,Variables!$E$3:$E$45,0),0)","v":"Y"},{"$f":"IF(INDEX(Variables!$B$2:$AT$45,MATCH('Error Codes'!$B31,Variables!$H$2:$H$45,0),MATCH(Survey_Year,Variables!$B$2:$AT$2,0))<>\"-\",\"Y\",\"N\")","v":"N"},{"$f":"IF(D31=\"N\",0,IF(E31=\"N\",0,IF(OFFSET($I31,0,MATCH(Cover!$C$14,$J$2:$AT$2,0))>0,1,0)))","v":0},{"$f":"COUNTIF($F$3:F31,\">\"&0)","v":6},{"$f":"COUNTIFS($C$3:C31,C31,$F$3:F31,1)","v":0},"Replace with 0",null,null,null,null,null,null,null,null,null,null,null,null,null,null,null,null,null,null,null,null,null,null,null,null,null,null,99998,99998,99998,99998,99998,99998,999998,999998,999998,999998,999998]
[null,"TIME UNIT-HD RPRTD UNEMPL COMP",{"$f":"INDEX(Variables!$B$2:$AT$45,MATCH($B32,Variables!$H$2:$H$45,0),MATCH(C$2,Variables!$B$2:$AT$2,0))","v":"unemp_inc4_TU"},{"$f":"OFFSET(Variables!$F$2,MATCH(C32,Variables!$E$3:$E$45,0),0)","v":"Y"},{"$f":"IF(INDEX(Variables!$B$2:$AT$45,MATCH('Error Codes'!$B32,Variables!$H$2:$H$45,0),MATCH(Survey_Year,Variables!$B$2:$AT$2,0))<>\"-\",\"Y\",\"N\")","v":"N"},{"$f":"IF(D32=\"N\",0,IF(E32=\"N\",0,IF(OFFSET($I32,0,MATCH(Cover!$C$14,$J$2:$AT$2,0))>0,1,0)))","v":0},{"$f":"COUNTIF($F$3:F32,\">\"&0)","v":6},{"$f":"COUNTIFS($C$3:C32,C32,$F$3:F32,1)","v":0},"Drop",null,null,null,null,null,null,null,null,null,null,null,null,null,null,null,null,null,null,null,null,null,null,null,null,null,9,9,9,9,9,9,9,9,9,9,9,9]
[null,"TIME UNIT-HD RPRTD UNEMPL COMP",{"$f":"INDEX(Variables!$B$2:$AT$45,MATCH($B33,Variables!$H$2:$H$45,0),MATCH(C$2,Variables!$B$2:$AT$2,0))","v":"unemp_inc4_TU"},{"$f":"OFFSET(Variables!$F$2,MATCH(C33,Variables!$E$3:$E$45,0),0)","v":"Y"},{"$f":"IF(INDEX(Variables!$B$2:$AT$45,MATCH('Error Codes'!$B33,Variables!$H$2:$H$45,0),MATCH(Survey_Year,Variables!$B$2:$AT$2,0))<>\"-\",\"Y\",\"N\")","v":"N"},{"$f":"IF(D33=\"N\",0,IF(E33=\"N\",0,IF(OFFSET($I33,0,MATCH(Cover!$C$14,$J$2:$AT$2,0))>0,1,0)))","v":0},{"$f":"COUNTIF($F$3:F33,\">\"&0)","v":6},{"$f":"COUNTIFS($C$3:C33,C33,$F$3:F33,1)","v":0},"Drop",null,null,null,null,null,null,null,null,null,null,null,null,null,null,null,null,null,null,null,null,null,null,null,null,null,7,8,8,8,8,8,8,8,8,8,8,8]
[null,"TIME UNIT-HD RPRTD UNEMPL COMP",{"$f":"INDEX(Variables!$B$2:$AT$45,MATCH($B34,Variables!$H$2:$H$45,0),MATCH(C$2,Variables!$B$2:$AT$2,0))","v":"unemp_inc4_TU"},{"$f":"OFFSET(Variables!$F$2,MATCH(C34,Variables!$E$3:$E$45,0),0)","v":"Y"},{"$f":"IF(INDEX(Variables!$B$2:$AT$45,MATCH('Error Codes'!$B34,Variables!$H$2:$H$45,0),MATCH(Survey_Year,Variables!$B$2:$AT$2,0))<>\"-\",\"Y\",\"N\")","v":"N"},{"$f":"IF(D34=\"N\",0,IF(E34=\"N\",0,IF(OFFSET($I34,0,MATCH(Cover!$C$14,$J$2:$AT$2,0))>0,1,0)))","v":0},{"$f":"COUNTIF($F$3:F34,\">\"&0)","v":6},{"$f":"COUNTIFS($C$3:C34,C34,$F$3:F34,1)","v":0},"Drop",null,null,null,null,null,null,null,null,null,null,null,null,null,null,null,null,null,null,null,null,null,null,null,null,null,null,5,5,7,7,7,7,7,7,7,7,7]
[null,"WF REPORTED UNEMP COMPENSATION",{"$f":"INDEX(Variables!$B$2:$AT$45,MATCH($B35,Variables!$H$2:$H$45,0),MATCH(C$2,Variables!$B$2:$AT$2,0))","v":"unemp_inc6"},{"$f":"OFFSET(Variables!$F$2,MATCH(C35,Variables!$E$3:$E$45,0),0)","v":"Y"},{"$f":"IF(INDEX(Variables!$B$2:$AT$45,MATCH('Error Codes'!$B35,Variables!$H$2:$H$45,0),MATCH(Survey_Year,Variables!$B$2:$AT$2,0))<>\"-\",\"Y\",\"N\")","v":"N"},{"$f":"IF(D35=\"N\",0,IF(E35=\"N\",0,IF(OFFSET($I35,0,MATCH(Cover!$C$14,$J$2:$AT$2,0))>0,1,0)))","v":0},{"$f":"COUNTIF($F$3:F35,\">\"&0)","v":6},{"$f":"COUNTIFS($C$3:C35,C35,$F$3:F35,1)","v":0},"Replace with 0",null,null,null,null,null,null,null,null,null,null,null,null,null,null,null,null,null,null,null,null,null,null,null,null,null,99999,99999,99999,99999,99999,99999,99999,999998,999998,999998,999998,999998]
[null,"WF REPORTED UNEMP COMPENSATION",{"$f":"INDEX(Variables!$B$2:$AT$45,MATCH($B36,Variables!$H$2:$H$45,0),MATCH(C$2,Variables!$B$2:$AT$2,0))","v":"unemp_inc6"},{"$f":"OFFSET(Variables!$F$2,MATCH(C36,Variables!$E$3:$E$45,0),0)","v":"Y"},{"$f":"IF(INDEX(Variables!$B$2:$AT$45,MATCH('Error Codes'!$B36,Variables!$H$2:$H$45,0),MATCH(Survey_Year,Variables!$B$2:$AT$2,0))<>\"-\",\"Y\",\"N\")","v":"N"},{"$f":"IF(D36=\"N\",0,IF(E36=\"N\",0,IF(OFFSET($I36,0,MATCH(Cover!$C$14,$J$2:$AT$2,0))>0,1,0)))","v":0},{"$f":"COUNTIF($F$3:F36,\">\"&0)","v":6},{"$f":"COUNTIFS($C$3:C36,C36,$F$3:F36,1)","v":0},"Replace with 0",null,null,null,null,null,null,null,null,null,null,null,null,null,null,null,null,null,null,null,null,null,null,null,null,null,null,99998,99998,99998,99998,99998,99998,999999,999999,999999,999999,999999]
[null,"TIME UNIT-WF REPORTED UNEMP COMP",{"$f":"INDEX(Variables!$B$2:$AT$45,MATCH($B37,Variables!$H$2:$H$45,0),MATCH(C$2,Variables!$B$2:$AT$2,0))","v":"unemp_inc6_TU"},{"$f":"OFFSET(Variables!$F$2,MATCH(C37,Variables!$E$3:$E$45,0),0)","v":"Y"},{"$f":"IF(INDEX(Variables!$B$2:$AT$45,MATCH('Error Codes'!$B37,Variables!$H$2:$H$45,0),MATCH(Survey_Year,Variables!$B$2:$AT$2,0))<>\"-\",\"Y\",\"N\")","v":"N"},{"$f":"IF(D37=\"N\",0,IF(E37=\"N\",0,IF(OFFSET($I37,0,MATCH(Cover!$C$14,$J$2:$AT$2,0))>0,1,0)))","v":0},{"$f":"COUNTIF($F$3:F37,\">\"&0)","v":6},{"$f":"COUNTIFS($C$3:C37,C37,$F$3:F37,1)","v":0},"Drop",null,null,null,null,null,null,null,null,null,null,null,null,null,null,null,null,null,null,null,null,null,null,null,null,null,9,9,9,9,9,9,9,9,9,9,9,9]
[null,"TIME UNIT-WF REPORTED UNEMP COMP",{"$f":"INDEX(Variables!$B$2:$AT$45,MATCH($B38,Variables!$H$2:$H$45,0),MATCH(C$2,Variables!$B$2:$AT$2,0))","v":"unemp_inc6_TU"},{"$f":"OFFSET(Variables!$F$2,MATCH(C38,Variables!$E$3:$E$45,0),0)","v":"Y"},{"$f":"IF(INDEX(Variables!$B$2:$AT$45,MATCH('Error Codes'!$B38,Variables!$H$2:$H$45,0),MATCH(Survey_Year,Variables!$B$2:$AT$2,0))<>\"-\",\"Y\",\"N\")","v":"N"},{"$f":"IF(D38=\"N\",0,IF(E38=\"N\",0,IF(OFFSET($I38,0,MATCH(Cover!$C$14,$J$2:$AT$2,0))>0,1,0)))","v":0},{"$f":"COUNTIF($F$3:F38,\">\"&0)","v":6},{"$f":"COUNTIFS($C$3:C38,C38,$F$3:F38,1)","v":0},"Drop",null,null,null,null,null,null,null,null,null,null,null,null,null,null,null,null,null,null,null,null,null,null,null,null,null,7,8,8,8,8,8,8,8,8,8,8,8]
[null,"TIME UNIT-WF REPORTED UNEMP COMP",{"$f":"INDEX(Variables!$B$2:$AT$45,MATCH($B39,Variables!$H$2:$H$45,0),MATCH(C$2,Variables!$B$2:$AT$2,0))","v":"unemp_inc6_TU"},{"$f":"OFFSET(Variables!$F$2,MATCH(C39,Variables!$E$3:$E$45,0),0)","v":"Y"},{"$f":"IF(INDEX(Variables!$B$2:$AT$45,MATCH('Error Codes'!$B39,Variables!$H$2:$H$45,0),MATCH(Survey_Year,Variables!$B$2:$AT$2,0))<>\"-\",\"Y\",\"N\")","v":"N"},{"$f":"IF(D39=\"N\",0,IF(E39=\"N\",0,IF(OFFSET($I39,0,MATCH(Cover!$C$14,$J$2:$AT$2,0))>0,1,0)))","v":0},{"$f":"COUNTIF($F$3:F39,\">\"&0)","v":6},{"$f":"COUNTIFS($C$3:C39,C39,$F$3:F39,1)","v":0},"Drop",null,null,null,null,null,null,null,null,null,null,null,null,null,null,null,null,null,null,null,null,null,null,null,null,null,null,5,5,7,7,7,7,7,7,7,7,7]
[null,"TOTAL FAMILY SOCIAL SECURITY INCOME",{"$f":"INDEX(Variables!$B$2:$AT$45,MATCH($B40,Variables!$H$2:$H$45,0),MATCH(C$2,Variables!$B$2:$AT$2,0))","v":"gssi4"},{"$f":"OFFSET(Variables!$F$2,MATCH(C40,Variables!$E$3:$E$45,0),0)","v":"Y"},{"$f":"IF(INDEX(Variables!$B$2:$AT$45,MATCH('Error Codes'!$B40,Variables!$H$2:$H$45,0),MATCH(Survey_Year,Variables!$B$2:$AT$2,0))<>\"-\",\"Y\",\"N\")","v":"N"},{"$f":"IF(D40=\"N\",0,IF(E40=\"N\",0,IF(OFFSET($I40,0,MATCH(Cover!$C$14,$J$2:$AT$2,0))>0,1,0)))","v":0},{"$f":"COUNTIF($F$3:F40,\">\"&0)","v":6},{"$f":"COUNTIFS($C$3:C40,C40,$F$3:F40,1)","v":0},"Drop",null,null,null,null,null,null,null,null,null,null,null,null,null,null,null,null,null,null,null,null,null,null,null,null,null,null,999999,999999]
[null,"DOLLARS RENT",{"$f":"INDEX(Variables!$B$2:$AT$45,MATCH($B41,Variables!$H$2:$H$45,0),MATCH(C$2,Variables!$B$2:$AT$2,0))","v":"rent2"},{"$f":"OFFSET(Variables!$F$2,MATCH(C41,Variables!$E$3:$E$45,0),0)","v":"Y"},{"$f":"IF(INDEX(Variables!$B$2:$AT$45,MATCH('Error Codes'!$B41,Variables!$H$2:$H$45,0),MATCH(Survey_Year,Variables!$B$2:$AT$2,0))<>\"-\",\"Y\",\"N\")","v":"N"},{"$f":"IF(D41=\"N\",0,IF(E41=\"N\",0,IF(OFFSET($I41,0,MATCH(Cover!$C$14,$J$2:$AT$2,0))>0,1,0)))","v":0},{"$f":"COUNTIF($F$3:F41,\">\"&0)","v":6},{"$f":"COUNTIFS($C$3:C41,C41,$F$3:F41,1)","v":0},"Drop",null,null,null,null,null,null,null,null,null,null,null,null,null,null,null,null,null,null,null,null,null,null,null,null,null,null,9999,99999,99999,99999,99999,99999,99999,99999,99999,99999,99999]
[null,"DOLLARS RENT",{"$f":"INDEX(Variables!$B$2:$AT$45,MATCH($B42,Variables!$H$2:$H$45,0),MATCH(C$2,Variables!$B$2:$AT$2,0))","v":"rent2"},{"$f":"OFFSET(Variables!$F$2,MATCH(C42,Variables!$E$3:$E$45,0),0)","v":"Y"},{"$f":"IF(INDEX(Variables!$B$2:$AT$45,MATCH('Error Codes'!$B42,Variables!$H$2:$H$45,0),MATCH(Survey_Year,Variables!$B$2:$AT$2,0))<>\"-\",\"Y\",\"N\")","v":"N"},{"$f":"IF(D42=\"N\",0,IF(E42=\"N\",0,IF(OFFSET($I42,0,MATCH(Cover!$C$14,$J$2:$AT$2,0))>0,1,0)))","v":0},{"$f":"COUNTIF($F$3:F42,\">\"&0)","v":6},{"$f":"COUNTIFS($C$3:C42,C42,$F$3:F42,1)","v":0},"Drop",null,null,null,null,null,null,null,null,null,null,null,null,null,null,null,null,null,null,null,null,null,null,null,null,null,null,null,99998,99998,99998,99998,99998,99998,99998,99998,99998,99998]
[null,"DOLLARS PER WHAT",{"$f":"INDEX(Variables!$B$2:$AT$45,MATCH($B43,Variables!$H$2:$H$45,0),MATCH(C$2,Variables!$B$2:$AT$2,0))","v":"rent2_TU"},{"$f":"OFFSET(Variables!$F$2,MATCH(C43,Variables!$E$3:$E$45,0),0)","v":"Y"},{"$f":"IF(INDEX(Variables!$B$2:$AT$45,MATCH('Error Codes'!$B43,Variables!$H$2:$H$45,0),MATCH(Survey_Year,Variables!$B$2:$AT$2,0))<>\"-\",\"Y\",\"N\")","v":"N"},{"$f":"IF(D43=\"N\",0,IF(E43=\"N\",0,IF(OFFSET($I43,0,MATCH(Cover!$C$14,$J$2:$AT$2,0))>0,1,0)))","v":0},{"$f":"COUNTIF($F$3:F43,\">\"&0)","v":6},{"$f":"COUNTIFS($C$3:C43,C43,$F$3:F43,1)","v":0},"Drop",null,null,null,null,null,null,null,null,null,null,null,null,null,null,null,null,null,null,null,null,null,null,null,null,null,"1, 2, 3, 4, 6, 7, 9","2, 3, 4, 8, 9","2, 3, 4, 6, 7, 8, 9","1, 2, 3, 4, 6, 7, 8, 9","2, 3, 4, 6, 7, 8, 9","2, 3, 4, 6, 7, 8, 9","2, 3, 4, 6, 7, 8, 9","2, 3, 4, 6, 7, 8, 9","2, 3, 4, 6, 7, 8, 9","2, 3, 4, 6, 7, 8, 9","2, 3, 4, 6, 7, 8, 9","2, 3, 4, 6, 7, 8, 9"]
[null,"YRLY PROP TAXES",{"$f":"INDEX(Variables!$B$2:$AT$45,MATCH($B44,Variables!$H$2:$H$45,0),MATCH(C$2,Variables!$B$2:$AT$2,0))","v":"prop_tax1"},{"$f":"OFFSET(Variables!$F$2,MATCH(C44,Variables!$E$3:$E$45,0),0)","v":"Y"},{"$f":"IF(INDEX(Variables!$B$2:$AT$45,MATCH('Error Codes'!$B44,Variables!$H$2:$H$45,0),MATCH(Survey_Year,Variables!$B$2:$AT$2,0))<>\"-\",\"Y\",\"N\")","v":"Y"},{"$f":"IF(D44=\"N\",0,IF(E44=\"N\",0,IF(OFFSET($I44,0,MATCH(Cover!$C$14,$J$2:$AT$2,0))>0,1,0)))","v":0},{"$f":"COUNTIF($F$3:F44,\">\"&0)","v":6},{"$f":"COUNTIFS($C$3:C44,C44,$F$3:F44,1)","v":0},"Drop",null,null,null,null,null,null,null,null,9999,9999,9999,9999,9999,null,null,null,null,null,null,null,null,null,null,null,null,null,99999,99999,99999,99999,99999,99999,99999,99999,99999,99999,99999]
[null,"YRLY PROP TAXES",{"$f":"INDEX(Variables!$B$2:$AT$45,MATCH($B45,Variables!$H$2:$H$45,0),MATCH(C$2,Variables!$B$2:$AT$2,0))","v":"prop_tax1"},{"$f":"OFFSET(Variables!$F$2,MATCH(C45,Variables!$E$3:$E$45,0),0)","v":"Y"},{"$f":"IF(INDEX(Variables!$B$2:$AT$45,MATCH('Error Codes'!$B45,Variables!$H$2:$H$45,0),MATCH(Survey_Year,Variables!$B$2:$AT$2,0))<>\"-\",\"Y\",\"N\")","v":"Y"},{"$f":"IF(D45=\"N\",0,IF(E45=\"N\",0,IF(OFFSET($I45,0,MATCH(Cover!$C$14,$J$2:$AT$2,0))>0,1,0)))","v":0},{"$f":"COUNTIF($F$3:F45,\">\"&0)","v":6},{"$f":"COUNTIFS($C$3:C45,C45,$F$3:F45,1)","v":0},"Drop",null,null,null,null,null,null,null,null,null,null,null,null,null,null,null,null,null,null,null,null,null,null,null,null,null,null,99998,99998,99998,99998,99998,99998,99998,99998,99998,99998,99998]
[null,"ITEMIZED CHARITABLE CONTRIB AMT",{"$f":"INDEX(Variables!$B$2:$AT$45,MATCH($B46,Variables!$H$2:$H$45,0),MATCH(C$2,Variables!$B$2:$AT$2,0))","v":"deduction1"},{"$f":"OFFSET(Variables!$F$2,MATCH(C46,Variables!$E$3:$E$45,0),0)","v":"Y"},{"$f":"IF(INDEX(Variables!$B$2:$AT$45,MATCH('Error Codes'!$B46,Variables!$H$2:$H$45,0),MATCH(Survey_Year,Variables!$B$2:$AT$2,0))<>\"-\",\"Y\",\"N\")","v":"N"},{"$f":"IF(D46=\"N\",0,IF(E46=\"N\",0,IF(OFFSET($I46,0,MATCH(Cover!$C$14,$J$2:$AT$2,0))>0,1,0)))","v":0},{"$f":"COUNTIF($F$3:F46,\">\"&0)","v":6},{"$f":"COUNTIFS($C$3:C46,C46,$F$3:F46,1)","v":0},"Replace with 0",null,null,null,null,null,null,null,null,null,null,null,null,null,null,null,null,null,null,null,null,null,null,null,null,null,null,null,null,null,null,999999,999999,999999,999999,999999,999999,999999]
[null,"ITEMIZED CHARITABLE CONTRIB AMT",{"$f":"INDEX(Variables!$B$2:$AT$45,MATCH($B47,Variables!$H$2:$H$45,0),MATCH(C$2,Variables!$B$2:$AT$2,0))","v":"deduction1"},{"$f":"OFFSET(Variables!$F$2,MATCH(C47,Variables!$E$3:$E$45,0),0)","v":"Y"},{"$f":"IF(INDEX(Variables!$B$2:$AT$45,MATCH('Error Codes'!$B47,Variables!$H$2:$H$45,0),MATCH(Survey_Year,Variables!$B$2:$AT$2,0))<>\"-\",\"Y\",\"N\")","v":"N"},{"$f":"IF(D47=\"N\",0,IF(E47=\"N\",0,IF(OFFSET($I47,0,MATCH(Cover!$C$14,$J$2:$AT$2,0))>0,1,0)))","v":0},{"$f":"COUNTIF($F$3:F47,\">\"&0)","v":6},{"$f":"COUNTIFS($C$3:C47,C47,$F$3:F47,1)","v":0},"Replace with 0",null,null,null,null,null,null,null,null,null,null,null,null,null,null,null,null,null,null,null,null,null,null,null,null,null,null,null,null,null,null,999998,999998,999998,999998,999998,999998,999998]
[null,"ITEMIZED MEDICAL EXPENSES AMT",{"$f":"INDEX(Variables!$B$2:$AT$45,MATCH($B48,Variables!$H$2:$H$45,0),MATCH(C$2,Variables!$B$2:$AT$2,0))","v":"deduction2"},{"$f":"OFFSET(Variables!$F$2,MATCH(C48,Variables!$E$3:$E$45,0),0)","v":"Y"},{"$f":"IF(INDEX(Variables!$B$2:$AT$45,MATCH('Error Codes'!$B48,Variables!$H$2:$H$45,0),MATCH(Survey_Year,Variables!$B$2:$AT$2,0))<>\"-\",\"Y\",\"N\")","v":"N"},{"$f":"IF(D48=\"N\",0,IF(E48=\"N\",0,IF(OFFSET($I48,0,MATCH(Cover!$C$14,$J$2:$AT$2,0))>0,1,0)))","v":0},{"$f":"COUNTIF($F$3:F48,\">\"&0)","v":6},{"$f":"COUNTIFS($C$3:C48,C48,$F$3:F48,1)","v":0},"Replace with 0",null,null,null,null,null,null,null,null,null,null,null,null,null,null,null,null,null,null,null,null,null,null,null,null,null,null,null,null,null,null,999999,999999,999999,999999,999999,999999,999999]
[null,"ITEMIZED MEDICAL EXPENSES AMT",{"$f":"INDEX(Variables!$B$2:$AT$45,MATCH($B49,Variables!$H$2:$H$45,0),MATCH(C$2,Variables!$B$2:$AT$2,0))","v":"deduction2"},{"$f":"OFFSET(Variables!$F$2,MATCH(C49,Variables!$E$3:$E$45,0),0)","v":"Y"},{"$f":"IF(INDEX(Variables!$B$2:$AT$45,MATCH('Error Codes'!$B49,Variables!$H$2:$H$45,0),MATCH(Survey_Year,Variables!$B$2:$AT$2,0))<>\"-\",\"Y\",\"N\")","v":"N"},{"$f":"IF(D49=\"N\",0,IF(E49=\"N\",0,IF(OFFSET($I49,0,MATCH(Cover!$C$14,$J$2:$AT$2,0))>0,1,0)))","v":0},{"$f":"COUNTIF($F$3:F49,\">\"&0)","v":6},{"$f":"COUNTIFS($C$3:C49,C49,$F$3:F49,1)","v":0},"Replace with 0",null,null,null,null,null,null,null,null,null,null,null,null,null,null,null,null,null,null,null,null,null,null,null,null,null,null,null,null,null,null,999998,999998,999998,999998,999998,999998,999998]

{"sheet":"Variables","index":11,"n_rows":45,"n_cols":46,"rows_kept":45,"cut":false,"hidden":false,"merged":[]}
[]
[null,"Category","Time Unit?","Category #","Variable Name","Included?","Description","PSID Name","PSID Description",1968,1969,1970,1971,1972,1973,1974,1975,1976,1977,1978,1979,1980,1981,1982,1983,1984,1985,1986,1987,1988,1989,1990,1991,1992,1993,1994,1995,1996,1997,1999,2001,2003,2005,2007,2009,2011]
[null,"age","N",{"$f":"IF(B3=B2,D2+1,1)","v":1},{"$f":"IF(C3=\"N\",CONCATENATE(B3,D3),CONCATENATE(E2,\"_TU\"))","v":"age1"},"Y","Head's Age","AGE OF HEAD","Age of Head of Family Unit","V117","V1008","V1239","V1942","V2542","V3095","V3508","V3921","V4436","V5350","V5850","V6462","V7067","V7658","V8352","V8961","V10419","V11606","V13011","V14114","V15130","V16631","V18049","V19349","V20651","V22406","ER2007","ER5006","ER7006","ER10009","ER13010","ER17013","ER21017","ER25017","ER36017","ER42017","ER47317"]
[null,"age","N",{"$f":"IF(B4=B3,D3+1,1)","v":2},{"$f":"IF(C4=\"N\",CONCATENATE(B4,D4),CONCATENATE(E3,\"_TU\"))","v":"age2"},"Y","Spouse's Age","AGE OF WIFE","Age of Wife of Head","V118","V1011","V1241","V1944","V2544","V3097","V3510","V3923","V4438","V5352","V5852","V6464","V7069","V7660","V8354","V8963","V10421","V11608","V13013","V14116","V15132","V16633","V18051","V19351","V20653","V22408","ER2009","ER5008","ER7008","ER10011","ER13012","ER17015","ER21019","ER25019","ER36019","ER42019","ER47319"]
[null,"childcare","N",{"$f":"IF(B5=B4,D4+1,1)","v":1},{"$f":"IF(C5=\"N\",CONCATENATE(B5,D5),CONCATENATE(E4,\"_TU\"))","v":"childcare1"},"Y","Child Care Expenses (Prior Year)","COST CHILD CARE","Cost of child care in YR-1 for families with female Head or Wives who worked in YR-1","-","-","V1164","V1865","V2465","-","-","-","V4717","V5259","-","V6387","-","-","-","-","-","V11990","-","-","V15761","V17296","V18700","V20000","V21300","V23159","ER3058","ER6057","ER8154","ER11048","ER14232","ER18362","ER21628","ER25628","ER36633","ER42652","ER47970"]
[null,"childcare","Y",2,"childcare1_TU","Y","Child Care Expenses (TU)","CHILD CARE COST PER","How much did you (and your family living there) pay for child care in YR-1?--TIME UNIT","-","-","-","-","-","-","-","-","-","-","-","-","-","-","-","-","-","-","-","-","-","-","-","-","-","-","-","-","-","-","-","-","-","-","ER36634","ER42653","ER47971"]
[null,"deduction","N",1,"deduction1","Y","Charitable Contribution Itemized Deduction","ITEMIZED CHARITABLE CONTRIB AMT","How much was your itemized deduction for charitable contributions?","-","-","-","-","-","-","-","-","-","-","-","-","-","-","-","-","-","-","-","-","-","-","-","-","-","-","-","-","-","-","ER14974","ER19162","ER22535","ER26516","ER37534","ER43525","ER48850"]
[null,"deduction","N",2,"deduction2","Y","Medical Expenses Itemized Deduction","ITEMIZED MEDICAL EXPENSES AMT","How much was your itemized deduction for medical expenses?","-","-","-","-","-","-","-","-","-","-","-","-","-","-","-","-","-","-","-","-","-","-","-","-","-","-","-","-","-","-","ER14975","ER19167","ER22536","ER26517","ER37535","ER43526","ER48851"]
[null,"family_ID","N",{"$f":"IF(B9=B8,D8+1,1)","v":1},{"$f":"IF(C9=\"N\",CONCATENATE(B9,D9),CONCATENATE(E8,\"_TU\"))","v":"family_ID1"},"Y","Family ID by Year","INTERVIEW NUMBER","Current Year Family Number","V3","V442","V1102","V1802","V2402","V3002","V3402","V3802","V4302","V5202","V5702","V6302","V6902","V7502","V8202","V8802","V10002","V11102","V12502","V13702","V14802","V16302","V17702","V19002","V20302","V21602","ER2002","ER5002","ER7002","ER10002","ER13002","ER17002","ER21002","ER25002","ER36002","ER42002","ER47302"]
[null,"tax_inc","N",{"$f":"IF(B10=B9,D9+1,1)","v":1},{"$f":"IF(C10=\"N\",CONCATENATE(B10,D10),CONCATENATE(E9,\"_TU\"))","v":"tax_inc1"},"Y","Total Taxable Income (Prior Year)","H+W TAXABLE INC","Taxable income of Head and Wife","V76","V518","V1205","V1906","V2507","V3060","V3472","V3872","V4386","V5297","V5796","V6408","V6998","V7590","V8283","V8891","V10277","V11419","V12818","V13920","V14935","V16435","V17851","V19151","V20451","V21959","ER4146","ER6986","ER9237","ER12069","ER16452","ER20449","ER24100","ER27953","ER40943","ER46851","ER52259"]
[null,"gssi","N",1,"gssi1","Y","Combined Social Security Income (Prior Year)","SOCIAL SECURITY","Income of Head and Wife from Social Security ","-","-","V1212","V1914","V2515","V3068","V3480","V3880","V4395","V5306","V5806","V6417","V7007","V7599","V8292","V8900","V10288","V11433","-","-","-","-","-","-","-","-","-","-","-","-","-","-","-","-","-","-","-"]
[null,"gssi","N",2,"gssi2","Y","Head's Social Security Income (Prior Year)","HD YR SOCIAL SECURITY","Amount of Social Security Payments Received","-","-","-","-","-","-","-","-","-","-","-","-","-","-","-","-","-","-","V12832","V13934","V14949","V16449","V17865","V19165","V20465","V22027","-","-","-","-","-","-","-","ER28031","ER41021","ER46929","ER52337"]
[null,"gssi","N",3,"gssi3","Y","Spouse's Social Security Income (Prior Year)","WF YR SOCIAL SECURITY","Amount of Social Security Payments Received","-","-","-","-","-","-","-","-","-","-","-","-","-","-","-","-","-","-","V12853","V13955","V14970","V16470","V17886","V19186","V20486","V22301","-","-","-","-","-","-","-","ER28033","ER41023","ER46931","ER52339"]
[null,"gssi","N",4,"gssi4","Y","Family's Social Security Income (Prior Year)","TOTAL FAMILY SOCIAL SECURITY INCOME","Total Family Income from Social Security ","-","-","-","-","-","-","-","-","-","-","-","-","-","-","-","-","-","-","-","-","-","-","-","-","-","-","ER4152","ER6992","ER9243","ER12077","ER16460","ER20455","ER24104","-","-","-","-"]
[null,"mstat","N",1,"mstat1","Y","Marital Status (Reported)","J1 MARITAL STATUS","Are you married, single, widowed, divorced, or separated?","-","-","-","-","-","-","-","-","-","V5502","V6034","V6659","V7261","V7952","V8603","V9276","V10426","V11612","V13017","V14120","V15136","V16637","V18055","V19355","V20657","V22412","ER2014","ER5013","ER7013","ER10016","ER13021","ER17024","ER21023","ER25023","ER36023","ER42023","ER47323"]
[null,"mstat","N",2,"mstat2","Y","Marital Status (Based on Cohabitation)","MARITAL STATUS","Are you married, single, widowed, divorced, or separated?","V239","V607","V1365","V2072","V2670","V3181","V3598","V4053","V4603","V5650","V6197","V6790","V7435","V8087","V8711","V9419","V11065","V12426","V13665","V14712","V16187","V17565","V18916","V20216","V21522","V23336","ER4159A","ER6999A","ER9250A","ER12223A","ER16423","ER20369","ER24150","ER28049","ER41039","ER46983","ER52407"]
[null,"num_dep","N",1,"num_dep1","Y","Number of Exemptions (Includes Head and Spouse)","H+W YR # DEPENDENTS","This includes Head, Wife, dependent children both in and out of the FU, and any other dependent persons","-","-","V1207","V1909","V2510","V3063","V3475","V3875","V4389","V5300","V5799","V6410","V7000","V7592","V8285","V8893","V10279","V11423","V12822","V13924","V14939","V16439","-","-","-","-","-","-","-","-","-","-","-","-","-","-","-"]
[null,"num_dep","N",2,"num_dep2","Y","Number Children <18","NUMBER OF CHILDREN","Number of Children Under 18 Living with Family","V398","V550","V1242","V1945","V2545","V3098","V3511","V3924","V4439","V5353","V5853","V6465","V7070","V7661","V8355","V8964","V10422","V11609","V13014","V14117","V15133","V16634","V18052","V19352","V20654","V22409","ER2010","ER5009","ER7009","ER10012","ER13013","ER17016","ER21020","ER25020","ER36020","ER42020","ER47320"]
[null,"num_dep","N",3,"num_dep3","Y","Number of Dependents Outside the Family Unit","DEPENDENTS NOT HERE","Are there any people that do NOT live with you who are dependent on you for more than half of their support? J45. (If yes) How many are there?","V278","V735","V1401","V2113","V2710","V3214","V3633","V4079","V4623","V5558","V6100","V6693","V7296","V7996","V8615","V9306","V10897","V11904","V13415","V14512","-","V17316","V18720","V20020","V21320","V23179","-","-","-","ER11721","ER14989","ER19185","ER22550","ER26531","ER37549","ER43540","ER48865"]
[null,"pension_inc","N",1,"pension_inc1","Y","Head's Total Taxable Retirement Income (Prior Year)","OTHER RETIREMENT","Head's Income from other retirement pay, pensions or annuities [non-social security income]","-","-","V1213","V1915","V2516","V3069","V3481","V3881","V4396","V5307","V5807","V6418","V7008","V7600","V8293","V8901","-","-","-","-","-","-","-","-","-","-","-","-","-","-","-","-","-","-","-","-","-"]
[null,"pension_inc","N",2,"pension_inc2","Y","Head's Non-Veteran Taxable Retirement Income (Prior Year)","HD OTHER RETIREMENT","Head's Other Retirement, Pensions and Annuities Received in YR-1","-","-","-","-","-","-","-","-","-","-","-","-","-","-","-","-","V10293","V11438","V12837","V13939","V14954","V16454","V17870","V19170","V20470","-","-","-","-","-","-","-","-","-","-","-","-"]
[null,"pension_inc","N",3,"pension_inc3","Y","Head's Veterans Retirement Income (Prior Year)","HD YR-1 VA PENSION","Amount of Veterans Administration Pension Payments Received in YR-1 by YR Head ","-","-","-","-","-","-","-","-","-","-","-","-","-","-","-","-","V10291","V11436","V12835","V13937","V14952","V16452","V17868","V19168","V20468","V22043","-","-","-","-","-","-","-","ER27960","ER40950","ER46858","ER52266"]
[null,"pension_inc","N",4,"pension_inc4","Y","Spouse's Non-Veteran Taxable Retirement Income (Prior Year)","WF OTHER RETIREMENT YR-1","Amount of Wife's/\"Wife's\" Other Retirement, Pensions and Annuities YR-1","-","-","-","-","-","-","-","-","-","-","-","-","-","-","-","-","-","V11451","V12858","V13960","V14975","V16475","V17891","V19191","V20491","V22317","-","-","-","-","-","-","-","ER27988","ER40978","ER46886","ER52294"]
[null,"pension_inc","N",5,"pension_inc5","Y","Spouse's Veterans Retirement Income (Prior Year)","WF YR-1 VA PENSION","Amount of Veterans Administration Pension Payments to Wife/\"Wife\" in YR-1","-","-","-","-","-","-","-","-","-","-","-","-","-","-","-","-","-","V11449","V12856","V13958","V14973","V16473","V17889","V19189","V20489","-","-","-","-","-","-","-","-","-","-","-","-"]
[null,"pension_inc","N",6,"pension_inc6","Y","Spouse's Non-Veteran Taxable Retirement Income (Prior Year)","WF REPRTD PENSION/ANNUITY INCOME","Did she receive any (other) income in YR-1 from pensions or annuities?","-","-","-","-","-","-","-","-","-","-","-","-","-","-","-","-","-","-","-","-","-","-","-","-","-","V22303","ER3644","ER6646","ER8763","ER11645","ER14911","ER19095","ER22468","ER26449","ER37467","ER43458","ER48783"]
[null,"pension_inc","Y",7,"pension_inc6_TU","Y","Spouse's Non-Veteran Taxable Retirement Income (TU)","TIME UNIT-WF RPRTD PENSION/ANNUITY","How much was from pensions or annuities? -- TIME UNIT","-","-","-","-","-","-","-","-","-","-","-","-","-","-","-","-","-","-","-","-","-","-","-","-","-","V22304","ER3645","ER6647","ER8764","ER11646","ER14912","ER19096","ER22469","ER26450","ER37468","ER43459","ER48784"]
[null,"pension_inc","N",8,"pension_inc8","Y","Head's Total Taxable Retirement Income (Prior Year)","HD REPORTED ANNUITY/IRA INCOME","Did you (HEAD) receive any income in 1992 from other retirement pay, pensions, or annuities?","-","-","-","-","-","-","-","-","-","-","-","-","-","-","-","-","-","-","-","-","-","-","-","-","-","V22061","ER3340","ER6341","ER8458","ER11352","ER14618","ER18782","ER22152","ER26133","ER37151","ER43142","ER48467"]
[null,"pension_inc","Y",9,"pension_inc8_TU","Y","Head's Total Taxable Retirement Income (TU)","TIME UNIT-HD RPRTD ANNUITIES/IRAS","How much was it? -- ANNUITIES AND IRAS TIME UNIT","-","-","-","-","-","-","-","-","-","-","-","-","-","-","-","-","-","-","-","-","-","-","-","-","-","V22062","ER3341","ER6342","ER8459","ER11353","ER14619","ER18783","ER22153","ER26134","ER37152","ER43143","ER48468"]
[null,"prop_tax","N",1,"prop_tax1","Y","Estimated Property Tax Payments","YRLY PROP TAXES","Property taxes … Estimated","V6","V822","V1509","V2221","V2846","V3254","V3674","V4152","V4325","V5224","-","V6325","V6923","V7523","V8219","V8823","V10024","V11131","V12530","V13730","-","-","V17730","V19030","V20330","V21617","ER2034","ER5033","ER7033","ER10037","ER13042","ER17046","ER21045","ER25036","ER36036","ER42037","ER47342"]
[null,"rent","N",1,"rent1","Y","Annual Rent (Prior Year)","YRLY RENT PAYTS","Annual rent paid","V10","V455","V1128","V1829","V2429","V3023","V3419","V3819","V4326","V5225","V5723","V6326","V6925","V7525","V8221","V8825","V10026","V11133","V12532","V13732","-","-","V17733","V19033","V20333","V21622","-","-","-","-","-","-","-","-","-","-","-"]
[null,"rent","N",2,"rent2","Y","Reported Rent","DOLLARS RENT","About how much rent do you pay a month?","-","-","-","-","-","-","-","-","-","-","-","-","-","-","-","-","-","-","-","-","-","-","-","-","-","V21620","ER2049","ER5048","ER7121","ER10060","ER13065","ER17074","ER21072","ER25063","ER36065","ER42080","ER47387"]
[null,"rent","Y",3,"rent2_TU","Y","Reported Rent (TU)","DOLLARS PER WHAT","About how much rent do you pay a month?--TIME UNIT","-","-","-","-","-","-","-","-","-","-","-","-","-","-","-","-","-","-","-","-","-","-","-","-","-","V21621","ER2050","ER5049","ER7122","ER10061","ER13066","ER17075","ER21073","ER25064","ER36066","ER42081","ER47388"]
[null,"state","N",1,"state1","Y","State Identifier","STATE NOW","State where lives now","V93","V537","V1103","V1803","V2403","V3003","V3403","V3803","V4303","V5203","V5703","V6303","V6903","V7503","V8203","V8803","V10003","V11103","V12503","V13703","V14803","V16303","V17703","V19003","V20303","V21603","ER4156","ER6996","ER9247","ER12221","ER13004","ER17004","ER21003","ER25003","ER36003","ER42003","ER47303"]
[null,"transfers","N",1,"transfers1","Y","Total Transfer Income (Prior Year)","TRANSFER Y H+W","Total transfer income in YR-1","-","-","V1220","V1922","V2523","V3076","V3488","V3889","V4404","V5316","V5815","V6426","V7016","V7608","V8301","V8909","V10305","V11461","V12868","V13970","V14985","V16485","V17901","V19201","V20501","V22366","ER4147","ER6987","ER9238","ER12071","ER16454","ER20450","ER24101","ER28002","ER40992","ER46900","ER52308"]
[null,"unemp_inc","N",1,"unemp_inc1","Y","Head's Unemployment Income and Worker's Compansation (Prior Year)","UNEMP,WRK.COMP","Head's Income from unemployment, or workmen's compensation","-","-","V1214","V1916","V2517","V3070","V3482","V3882","V4397","-","-","-","-","-","-","-","-","-","-","-","-","-","-","-","-","-","-","-","-","-","-","-","-","-","-","-","-"]
[null,"unemp_inc","N",2,"unemp_inc2","Y","Head's Unemployment Income (Prior Year)","HD YR UNEMPLOYMENTCOMP","Amount of Head's unemployment pay (including strike benefits) in YR-1","-","-","-","-","-","-","-","-","-","V5308","V5808","V6419","V7009","V7601","V8294","V8902","V10295","V11440","V12839","V13941","V14956","V16456","V17872","V19172","V20472","V22108","-","-","-","-","-","-","-","ER27968","ER40958","ER46866","ER52274"]
[null,"unemp_inc","N",3,"unemp_inc3","Y","Spouse's Unemployement Income (Prior Year)","WF YR-1 UNEMP COMP","Amount of Wife's/\"Wife's\" Unemployment Compensation (including Strike Benefits) in YR-1","-","-","-","-","-","-","-","-","-","-","-","-","-","-","-","-","-","V11452","V12859","V13961","V14976","V16476","V17892","V19192","V20492","V22204","-","-","-","-","-","-","-","ER27990","ER40980","ER46888","ER52296"]
[null,"unemp_inc","N",4,"unemp_inc4","Y","Head's Unemployment Income (Prior Year)","HD REPORTED UNEMPL COMP INCOME","Did you (HEAD) receive any income in YR-1 from unemployment compensation? How much was it?","-","-","-","-","-","-","-","-","-","-","-","-","-","-","-","-","-","-","-","-","-","-","-","-","-","V22094","ER3371","ER6372","ER8489","ER11383","ER14649","ER18815","ER22185","ER26166","ER37184","ER43175","ER48500"]
[null,"unemp_inc","Y",5,"unemp_inc4_TU","Y","Head's Unemployment Income (TU)","TIME UNIT-HD RPRTD UNEMPL COMP","How much was it? - TIME UNIT","-","-","-","-","-","-","-","-","-","-","-","-","-","-","-","-","-","-","-","-","-","-","-","-","-","V22095","ER3372","ER6373","ER8490","ER11384","ER14650","ER18816","ER22186","ER26167","ER37185","ER43176","ER48501"]
[null,"unemp_inc","N",6,"unemp_inc6","Y","Spouse's Unemployement Income (Prior Year)","WF REPORTED UNEMP COMPENSATION","Did she receive any unemployment compensation in YR-1? How much was that?","-","-","-","-","-","-","-","-","-","-","-","-","-","-","-","-","-","-","-","-","-","-","-","-","-","V22190","ER3494","ER6495","ER8612","ER11494","ER14760","ER18934","ER22304","ER26285","ER37303","ER43294","ER48619"]
[null,"unemp_inc","Y",7,"unemp_inc6_TU","Y","Spouse's Unemployement Income (TU)","TIME UNIT-WF REPORTED UNEMP COMP","How much was that? - TIME UNIT","-","-","-","-","-","-","-","-","-","-","-","-","-","-","-","-","-","-","-","-","-","-","-","-","-","V22191","ER3495","ER6496","ER8613","ER11495","ER14761","ER18935","ER22305","ER26286","ER37304","ER43295","ER48620"]
[null,"wages","N",1,"wages1","Y","Head's Labor Income (Prior Year)","HDS LABOR INCOME","Head's money income from labor","V74","V514","V1196","V1897","V2498","V3051","V3463","V3863","V5031","V5627","V6174","V6767","V7413","V8066","V8690","V9376","V11023","V12372","V13624","V14671","V16145","V17534","V18878","V20178","V21484","V23323","ER4140","ER6980","ER9231","ER12080","ER16463","ER20443","ER24116","ER27931","ER40921","ER46829","ER52237"]
[null,"wages","N",2,"wages2","Y","Spouse's Labor Income (Prior Year)","LABOR INC WIFE","Wife's money income from work","V75","V516","V1198","V1899","V2500","V3053","V3465","V3865","V4379","V5289","V5788","V6398","V6988","V7580","V8273","V8881","V10263","V11404","V12803","V13905","V14920","V16420","V17836","V19136","V20436","V23324","-","-","-","-","-","-","-","-","-","-","-"]
[null,"wages","N",3,"wages3","Y","Spouse's Labor Income (Prior Year) Exclusing Business and Farm Income","LABOR INCOME OF WIFE","Wife's/\"Wife's\" YR-1 Labor Income, Excluding Farm and Unincorporated Business Income","-","-","-","-","-","-","-","-","-","-","-","-","-","-","-","-","-","-","-","-","-","-","-","-","-","V21807","ER4144","ER6984","ER9235","ER12082","ER16465","ER20447","ER24135","ER27943","ER40933","ER46841","ER52249"]
[null,"wages","N",4,"wages4","Y","Spouse's Labor Income from Business (Prior Year)","WF LABOR PART OF YR-1 BUSINESS INCOME","Wife/\"Wife\"'s Labor Part of Business Income in YR-1","-","-","-","-","-","-","-","-","-","-","-","-","-","-","-","-","-","-","-","-","-","-","-","-","-","V21806","ER4141","ER6981","ER9232","ER12214","ER16511","ER20444","ER24111","ER27940","ER40930","ER46838","ER52246"]

{"sheet":"Lookup","index":12,"n_rows":53,"n_cols":10,"rows_kept":53,"cut":false,"hidden":false,"merged":[]}
[]
[null,"Responses",null,"State Abbv","TAXSIM Code","PSID Code",null,"Mstat1 Meaning","TAXSIM Code","PSID Code"]
[null,"Yes",null,"AL",1,1,null,"Married",2,1]
[null,"No",null,"AK",2,50,null,"Single / Never Married",1,2]
[null,null,null,"AZ",3,2,null,"Widowed",1,3]
[null,null,null,"AR",4,3,null,"Divorced / Annulled",1,4]
[null,null,null,"CA",5,4,null,"Separated",2,5]
[null,null,null,"CO",6,5,null,"Married, Spouse Absent",2,8]
[null,null,null,"CT",7,6]
[null,null,null,"DE",8,7]
[null,null,null,"DC",9,8]
[null,null,null,"FL",10,9]
[null,null,null,"GA",11,10]
[null,null,null,"HI",12,51]
[null,null,null,"ID",13,11]
[null,null,null,"IL",14,12]
[null,null,null,"IN",15,13]
[null,null,null,"IA",16,14]
[null,null,null,"KS",17,15]
[null,null,null,"KY",18,16]
[null,null,null,"LA",19,17]
[null,null,null,"ME",20,18]
[null,null,null,"MD",21,19]
[null,null,null,"MA",22,20]
[null,null,null,"MI",23,21]
[null,null,null,"MN",24,22]
[null,null,null,"MS",25,23]
[null,null,null,"MO",26,24]
[null,null,null,"MT",27,25]
[null,null,null,"NE",28,26]
[null,null,null,"NV",29,27]
[null,null,null,"NH",30,28]
[null,null,null,"NJ",31,29]
[null,null,null,"NM",32,30]
[null,null,null,"NY",33,31]
[null,null,null,"NC",34,32]
[null,null,null,"ND",35,33]
[null,null,null,"OH",36,34]
[null,null,null,"OK",37,35]
[null,null,null,"OR",38,36]
[null,null,null,"PA",39,37]
[null,null,null,"RI",40,38]
[null,null,null,"SC",41,39]
[null,null,null,"SD",42,40]
[null,null,null,"TN",43,41]
[null,null,null,"TX",44,42]
[null,null,null,"UT",45,43]
[null,null,null,"VT",46,44]
[null,null,null,"VA",47,45]
[null,null,null,"WA",48,46]
[null,null,null,"WV",49,47]
[null,null,null,"WI",50,48]
[null,null,null,"WY",51,49]