{"text_format":"1","workbook":"xlsx","n_sheets":13,"sheets":["Cover","Code>","Preamble","Rename","Clean","Annualize","TAXSIM","Inputs>","Time Units","Indicators","Error Codes","Variables","Lookup"],"not_rendered":{"charts":0,"images":0,"macros":1,"external_links":0,"defined_names":17,"comments":0,"pivot_tables":0},"unopened":[],"bounds":{"document_bytes":16777216,"sheet_cells":100000,"rows_first":2000,"rows_last":500,"rows_between":2000,"halvings":0,"cell_chars":16384,"cell_head_chars":4096},"cells_cut":0,"cells_raw":0,"read":"whole","date_system":"1900"}

{"sheet":"Cover","index":0,"n_rows":27,"n_cols":8,"rows_kept":27,"cut":false,"hidden":false,"merged":[[12,7,14,7],[12,6,13,6],[9,1,10,4],[5,7,6,7],[8,7,9,7],[5,6,6,6],[8,6,9,6],[10,7,11,7],[10,6,11,6],[3,1,8,4]]}
[]
[]
[null,"Instructions",null,null,null,null,"Table of Contents"]
[null,"This file is designed to generate Stata code which evaluates the tax liability of PSID families using taxsim9. In order to run the code generated in this file, you will need to have taxsim9 installed in Stata and a .dta file of PSID family variables for the survey year (adjustable below). The PSID data should have the original PSID data names; otherwise you will need to update the data names in the Variables tab. Prior to extracting the code, specify below the PSID data year you are using, the name of the data file,  and where you want to store code. Other adjustable options are also included below. Once your file preferences and locations are specified you can generate a .txt file with the complete code included by pressing the \"Generate Code\" button below. To make the .txt file stata compatible you will need to change the extension to .do. The code will rename and clean the data, prepare TAXSIM inputs, and call taxsim9 in Stata.",null,null,null,null,"Tab Name","Description"]
[null,null,null,null,null,null,"Code Tabs"]
[null,null,null,null,null,null,"Preamble","Generates code preamble, including file settings and locations."]
{"$rows_left_out":22}
{"sheet":"Code>","index":1,"n_rows":0,"n_cols":0,"rows_kept":0,"cut":false,"hidden":false,"merged":[]}

{"sheet":"Preamble","index":2,"n_rows":49,"n_cols":4,"rows_kept":49,"cut":false,"hidden":false,"merged":[]}
[]
[null,"File Preamble (Stata Code)",null,"Additional Dividers"]
[]
[null,"****************************************************************************************************",null,"*** Drop Variables Not Used by TAXSIM"]
[null,{"$f":"CONCATENATE(\"* Annual TAXSIM Calculator for PSID Data: \",Cover!$C$14)","v":"* Annual TAXSIM Calculator for PSID Data: 1968"},null,{"$f":"IF(Cover!$C$19=\"YES\",\"capture drop V*\",\"* Drop of unused variables not selected\")","v":"capture drop V*"}]
[null,"* Authors: Margaret McKeehan and Nick Frazier",null,{"$f":"IF(Cover!$C$19=\"YES\",\"capture drop ER*\",\"* Drop of unused variables not selected\")","v":"capture drop ER*"}]
{"$rows_left_out":44}
{"sheet":"Rename","index":3,"n_rows":103,"n_cols":10,"rows_kept":103,"cut":false,"hidden":false,"merged":[[1,3,1,9]]}
[]
[null,"Rename Variables (Stata Code)",null,"Input Calculations"]
[null,{"$f":"CONCATENATE(\"*** Rename \",Cover!$C$14,\" Variables\")","v":"*** Rename 1968 Variables"}," ","ID","Variable","PSID ID","Use?","Count","Var","Tag"]
[null,{"$f":"IF($I4=\"\",\"\",CONCATENATE(\"rename \",TRIM($I4),\" \",$J4,\"_\",Cover!$C$14,\", replace\"))","v":"rename V117 age1_1968, replace"},null,1,{"$f":"IF(Variables!E3=\"\",\"\",Variables!E3)","v":"age1"},{"$f":"IFERROR(INDEX(Variables!$B:$BY,MATCH($E4,Variables!$E:$E,0),MATCH(Cover!$C$14,Variables!$B$2:$BY$2,0)),\"\")","v":"V117"},{"$f":"IF(E4=\"\",\"\",IF(F4=\"-\",\"N\",INDEX(Variables!$B:$BY,MATCH(E4,Variables!$E:$E,0),MATCH(\"Included?\",Variables!$B$2:$BY$2,0))))","v":"Y"},{"$f":"IF(G4=\"\",\"\",COUNTIF($G$4:G4,\"Y\"))","v":1},{"$f":"IFERROR(TRIM(INDEX($F:$F,MATCH($D4,$H:$H,0),1)),\"\")","v":"V117"},{"$f":"IFERROR(TRIM(INDEX($E:$E,MATCH($I4,$F:$F,0),1)),\"\")","v":"age1"}]
[null,{"$f":"IF($I5=\"\",\"\",CONCATENATE(\"rename \",TRIM($I5),\" \",$J5,\"_\",Cover!$C$14,\", replace\"))","v":"rename V118 age2_1968, replace"}," ",2,{"$f":"IF(Variables!E4=\"\",\"\",Variables!E4)","v":"age2"},{"$f":"IFERROR(INDEX(Variables!$B:$BY,MATCH($E5,Variables!$E:$E,0),MATCH(Cover!$C$14,Variables!$B$2:$BY$2,0)),\"\")","v":"V118"},{"$f":"IF(E5=\"\",\"\",IF(F5=\"-\",\"N\",INDEX(Variables!$B:$BY,MATCH(E5,Variables!$E:$E,0),MATCH(\"Included?\",Variables!$B$2:$BY$2,0))))","v":"Y"},{"$f":"IF(G5=\"\",\"\",COUNTIF($G$4:G5,\"Y\"))","v":2},{"$f":"IFERROR(TRIM(INDEX($F:$F,MATCH($D5,$H:$H,0),1)),\"\")","v":"V118"},{"$f":"IFERROR(TRIM(INDEX($E:$E,MATCH($I5,$F:$F,0),1)),\"\")","v":"age2"}]
[null,{"$f":"IF($I6=\"\",\"\",CONCATENATE(\"rename \",TRIM($I6),\" \",$J6,\"_\",Cover!$C$14,\", replace\"))","v":"rename V3 family_ID1_1968, replace"},null,3,{"$f":"IF(Variables!E5=\"\",\"\",Variables!E5)","v":"childcare1"},{"$f":"IFERROR(INDEX(Variables!$B:$BY,MATCH($E6,Variables!$E:$E,0),MATCH(Cover!$C$14,Variables!$B$2:$BY$2,0)),\"\")","v":"-"},{"$f":"IF(E6=\"\",\"\",IF(F6=\"-\",\"N\",INDEX(Variables!$B:$BY,MATCH(E6,Variables!$E:$E,0),MATCH(\"Included?\",Variables!$B$2:$BY$2,0))))","v":"N"},{"$f":"IF(G6=\"\",\"\",COUNTIF($G$4:G6,\"Y\"))","v":2},"V3","family_ID1"]
{"$rows_left_out":98}
{"sheet":"Clean","index":4,"n_rows":103,"n_cols":12,"rows_kept":103,"cut":false,"hidden":false,"merged":[[1,3,1,11]]}
[]
[null,"Clean Variables (Stata Code)",null,"Input Calculations"]
[null,{"$f":"CONCATENATE(\"*** Clean \",Cover!$C$14,\" Variables\")","v":"*** Clean 1968 Variables"},null,"#","Variable Name","Error Code","Action","Full Variable Name","Replace with","Cond. Code if List","Numeric","Final Conditional"]
[null,{"$f":"IF(E4=\"\",\"\",CONCATENATE(\"replace \",H4,\" = \",I4,\" if \",L4))","v":"replace age1_1968 = . if age1_1968 == 98"},null,1,{"$f":"IFERROR(TRIM(INDEX('Error Codes'!$B:$AT,MATCH($D4,'Error Codes'!$G:$G,0),MATCH($E$3,'Error Codes'!$B$2:$AT$2,0))),\"\")","v":"age1"},{"$f":"IFERROR(TRIM(INDEX('Error Codes'!$B:$AT,MATCH($D4,'Error Codes'!$G:$G,0),MATCH(Cover!$C$14,'Error Codes'!$B$2:$AT$2,0))),\"\")","v":"98"},{"$f":"IFERROR(INDEX('Error Codes'!$B:$AT,MATCH($D4,'Error Codes'!$G:$G,0),MATCH($G$3,'Error Codes'!$B$2:$AT$2,0)),\"\")","v":"Drop"},{"$f":"IF(E4=\"\",\"\",CONCATENATE(E4,\"_\",Cover!$C$14))","v":"age1_1968"},{"$f":"IF(G4=\"\",\"\",IF(G4=\"Drop\",\".\",0))","v":"."},{"$f":"IF(H4=\"\",\"\",CONCATENATE(\"inlist(\",H4,\", \",F4,\")\"))","v":"inlist(age1_1968, 98)"},{"$f":"IF(H4=\"\",\"\",IFERROR(VALUE(F4),\"NA\"))","v":98},{"$f":"IF(H4=\"\",\"\",IF(K4=\"NA\",J4,CONCATENATE(H4,\" == \",K4)))","v":"age1_1968 == 98"}]
[null,{"$f":"IF(E5=\"\",\"\",CONCATENATE(\"replace \",H5,\" = \",I5,\" if \",L5))","v":"replace age1_1968 = . if age1_1968 == 99"},null,2,{"$f":"IFERROR(TRIM(INDEX('Error Codes'!$B:$AT,MATCH($D5,'Error Codes'!$G:$G,0),MATCH($E$3,'Error Codes'!$B$2:$AT$2,0))),\"\")","v":"age1"},{"$f":"IFERROR(TRIM(INDEX('Error Codes'!$B:$AT,MATCH($D5,'Error Codes'!$G:$G,0),MATCH(Cover!$C$14,'Error Codes'!$B$2:$AT$2,0))),\"\")","v":"99"},{"$f":"IFERROR(INDEX('Error Codes'!$B:$AT,MATCH($D5,'Error Codes'!$G:$G,0),MATCH($G$3,'Error Codes'!$B$2:$AT$2,0)),\"\")","v":"Drop"},{"$f":"IF(E5=\"\",\"\",CONCATENATE(E5,\"_\",Cover!$C$14))","v":"age1_1968"},{"$f":"IF(G5=\"\",\"\",IF(G5=\"Drop\",\".\",0))","v":"."},{"$f":"IF(H5=\"\",\"\",CONCATENATE(\"inlist(\",H5,\", \",F5,\")\"))","v":"inlist(age1_1968, 99)"},{"$f":"IF(H5=\"\",\"\",IFERROR(VALUE(F5),\"NA\"))","v":99},{"$f":"IF(H5=\"\",\"\",IF(K5=\"NA\",J5,CONCATENATE(H5,\" == \",K5)))","v":"age1_1968 == 99"}]
[null,"replace age2_1968 = . if age2_1968 == 99",null,3,{"$f":"IFERROR(TRIM(INDEX('Error Codes'!$B:$AT,MATCH($D6,'Error Codes'!$G:$G,0),MATCH($E$3,'Error Codes'!$B$2:$AT$2,0))),\"\")","v":"age2"},{"$f":"IFERROR(TRIM(INDEX('Error Codes'!$B:$AT,MATCH($D6,'Error Codes'!$G:$G,0),MATCH(Cover!$C$14,'Error Codes'!$B$2:$AT$2,0))),\"\")","v":"99"},{"$f":"IFERROR(INDEX('Error Codes'!$B:$AT,MATCH($D6,'Error Codes'!$G:$G,0),MATCH($G$3,'Error Codes'!$B$2:$AT$2,0)),\"\")","v":"Drop"},{"$f":"IF(E6=\"\",\"\",CONCATENATE(E6,\"_\",Cover!$C$14))","v":"age2_1968"},".","inlist(age2_1968, 99)",99,"age2_1968 == 99"]
{"$rows_left_out":98}
{"sheet":"Annualize","index":5,"n_rows":73,"n_cols":25,"rows_kept":73,"cut":false,"hidden":false,"merged":[[1,11,1,24]]}
[]
[null,"List of All Time Unit Variables",null,null,null,null,"Annualize (Stata Code)",null,null,"Set Multipliers (Stata Code)",null,"Input Calculations"]
[null,"PSID Name","Variable Name","Included?","This Year?",null,"*** Annualize Values",null,null,"*** Replace Time Unit Indicators with Multiplier Values",null,"Var #","Unit","PSID Name","Variable Name","Replace With","Matching Name","Available?","Condition","Numeric","Cond. Code if List","Multiplier Code","Variable Applies To","Annualization Code","Count"]
[null,"CHILD CARE COST PER",{"$f":"IF(B4=\"\",\"\",OFFSET(Variables!$E$2,MATCH(B4,Variables!$H$3:$H$45,0),0))","v":"childcare1_TU"},{"$f":"IFERROR(INDEX(Variables!$B$2:$AT$45,MATCH($B4,Variables!$H$2:$H$45,0),MATCH(\"Included?\",Variables!$B$2:$AT$2,0)),\"\")","v":"Y"},{"$f":"IFERROR(IF(INDEX(Variables!$1:$1048576,MATCH(B4,Variables!$H:$H,0),MATCH(Cover!$C$14,Variables!$2:$2,0))=\"-\",\"N\",\"Y\"),\"\")","v":"N"},null,{"$f":"IF(C4=\"\",\"\",IF(AND(D4=\"Y\",E4=\"Y\"),OFFSET($X$3,MATCH(C4,$O$4:$O$73,0),0),CONCATENATE(\"* Variable \",C4,\" not included in data set\")))","v":"* Variable childcare1_TU not included in data set"},null,1,{"$f":"IFERROR(OFFSET($V$3,MATCH(I4,$Y$4:$Y$45,0),0),\"\")","v":""},null,1,"Hour",{"$f":"IF(OFFSET($B$3,L4,0)=\"\",\"\",OFFSET($B$3,L4,0))","v":"CHILD CARE COST PER"},{"$f":"IF(N4=\"\",\"\",OFFSET(Variables!$E$2,MATCH(N4,Variables!$H$3:$H$45,0),0))","v":"childcare1_TU"},{"$f":"IF(N4=\"\",\"\",HLOOKUP(M4,'Time Units'!$E$2:$K$3,2,0))","v":"."},{"$f":"IF(N4=\"\",\"\",IF(Cover!$C$14>1996,'Time Units'!$D$4,CONCATENATE(O4,\"_\",Cover!$C$14)))","v":"childcare1_TU_1968"},{"$f":"IF(N4=\"\",\"\",AND(OFFSET($D$3,MATCH(N4,$B$4:$B$13,0),0)=\"Y\",OFFSET($E$3,MATCH(N4,$B$4:$B$13,0),0)=\"Y\"))","v":false},{"$f":"IF(N4=\"\",\"\",IF(R4,INDEX('Time Units'!$B:$K,MATCH(Q4,'Time Units'!$D:$D,0),MATCH(M4,'Time Units'!$B$2:$K$2,0)),0))","v":0},{"$f":"IF(S4=\"\",\"\",IFERROR(VALUE(S4),\"NA\"))","v":0},{"$f":"IF(T4=\"\",\"\",IF(T4=\"NA\",CONCATENATE(\"inlist(\",Q4,\", \",S4,\")\"),CONCATENATE(O4,\" == \",T4)))","v":"childcare1_TU == 0"},{"$f":"IF(N4=\"\",\"\",CONCATENATE(\"replace \",O4,\"_\",Cover!$C$14,\" = \",P4,\" if \",U4))","v":"replace childcare1_TU_1968 = . if childcare1_TU == 0"},{"$f":"IF(N4=\"\",\"\",CONCATENATE(LEFT(O4,LEN(O4)-3),\"_\",Cover!$C$14))","v":"childcare1_1968"},{"$f":"IF(N4=\"\",\"\",CONCATENATE(\"replace \",W4,\" = \",W4))","v":"replace childcare1_1968 = childcare1_1968"},{"$f":"IF(N4=\"\",\"\",IF(S4>0,IF(ISNUMBER(Y3),Y3+1,1),IF(ISNUMBER(Y3),Y3,0)))","v":0}]
[null,"TIME UNIT-WF RPRTD PENSION/ANNUITY",{"$f":"IF(B5=\"\",\"\",OFFSET(Variables!$E$2,MATCH(B5,Variables!$H$3:$H$45,0),0))","v":"pension_inc6_TU"},{"$f":"IFERROR(INDEX(Variables!$B$2:$AT$45,MATCH($B5,Variables!$H$2:$H$45,0),MATCH(\"Included?\",Variables!$B$2:$AT$2,0)),\"\")","v":"Y"},{"$f":"IFERROR(IF(INDEX(Variables!$1:$1048576,MATCH(B5,Variables!$H:$H,0),MATCH(Cover!$C$14,Variables!$2:$2,0))=\"-\",\"N\",\"Y\"),\"\")","v":"N"},null,{"$f":"IF(C5=\"\",\"\",IF(AND(D5=\"Y\",E5=\"Y\"),OFFSET($X$3,MATCH(C5,$O$4:$O$73,0),0),CONCATENATE(\"* Variable \",C5,\" not included in data set\")))","v":"* Variable pension_inc6_TU not included in data set"},null,2,{"$f":"IFERROR(OFFSET($V$3,MATCH(I5,$Y$4:$Y$45,0),0),\"\")","v":""},null,1,"Day",{"$f":"IF(OFFSET($B$3,L5,0)=\"\",\"\",OFFSET($B$3,L5,0))","v":"CHILD CARE COST PER"},{"$f":"IF(N5=\"\",\"\",OFFSET(Variables!$E$2,MATCH(N5,Variables!$H$3:$H$45,0),0))","v":"childcare1_TU"},{"$f":"IF(N5=\"\",\"\",HLOOKUP(M5,'Time Units'!$E$2:$K$3,2,0))","v":"."},{"$f":"IF(N5=\"\",\"\",IF(Cover!$C$14>1996,'Time Units'!$D$4,CONCATENATE(O5,\"_\",Cover!$C$14)))","v":"childcare1_TU_1968"},{"$f":"IF(N5=\"\",\"\",AND(OFFSET($D$3,MATCH(N5,$B$4:$B$13,0),0)=\"Y\",OFFSET($E$3,MATCH(N5,$B$4:$B$13,0),0)=\"Y\"))","v":false},{"$f":"IF(N5=\"\",\"\",IF(R5,INDEX('Time Units'!$B:$K,MATCH(Q5,'Time Units'!$D:$D,0),MATCH(M5,'Time Units'!$B$2:$K$2,0)),0))","v":0},{"$f":"IF(S5=\"\",\"\",IFERROR(VALUE(S5),\"NA\"))","v":0},{"$f":"IF(T5=\"\",\"\",IF(T5=\"NA\",CONCATENATE(\"inlist(\",Q5,\", \",S5,\")\"),CONCATENATE(O5,\" == \",T5)))","v":"childcare1_TU == 0"},{"$f":"IF(N5=\"\",\"\",CONCATENATE(\"replace \",O5,\"_\",Cover!$C$14,\" = \",P5,\" if \",U5))","v":"replace childcare1_TU_1968 = . if childcare1_TU == 0"},{"$f":"IF(N5=\"\",\"\",CONCATENATE(LEFT(O5,LEN(O5)-3),\"_\",Cover!$C$14))","v":"childcare1_1968"},{"$f":"IF(N5=\"\",\"\",CONCATENATE(\"replace \",W5,\" = \",W5))","v":"replace childcare1_1968 = childcare1_1968"},0]
[null,"TIME UNIT-HD RPRTD ANNUITIES/IRAS",{"$f":"IF(B6=\"\",\"\",OFFSET(Variables!$E$2,MATCH(B6,Variables!$H$3:$H$45,0),0))","v":"pension_inc8_TU"},{"$f":"IFERROR(INDEX(Variables!$B$2:$AT$45,MATCH($B6,Variables!$H$2:$H$45,0),MATCH(\"Included?\",Variables!$B$2:$AT$2,0)),\"\")","v":"Y"},{"$f":"IFERROR(IF(INDEX(Variables!$1:$1048576,MATCH(B6,Variables!$H:$H,0),MATCH(Cover!$C$14,Variables!$2:$2,0))=\"-\",\"N\",\"Y\"),\"\")","v":"N"},null,"* Variable pension_inc8_TU not included in data set",null,3,"",null,1,"Week","CHILD CARE COST PER",{"$f":"IF(N6=\"\",\"\",OFFSET(Variables!$E$2,MATCH(N6,Variables!$H$3:$H$45,0),0))","v":"childcare1_TU"},{"$f":"IF(N6=\"\",\"\",HLOOKUP(M6,'Time Units'!$E$2:$K$3,2,0))","v":"."},{"$f":"IF(N6=\"\",\"\",IF(Cover!$C$14>1996,'Time Units'!$D$4,CONCATENATE(O6,\"_\",Cover!$C$14)))","v":"childcare1_TU_1968"},false,{"$f":"IF(N6=\"\",\"\",IF(R6,INDEX('Time Units'!$B:$K,MATCH(Q6,'Time Units'!$D:$D,0),MATCH(M6,'Time Units'!$B$2:$K$2,0)),0))","v":0},0,"childcare1_TU == 0",{"$f":"IF(N6=\"\",\"\",CONCATENATE(\"replace \",O6,\"_\",Cover!$C$14,\" = \",P6,\" if \",U6))","v":"replace childcare1_TU_1968 = . if childcare1_TU == 0"},{"$f":"IF(N6=\"\",\"\",CONCATENATE(LEFT(O6,LEN(O6)-3),\"_\",Cover!$C$14))","v":"childcare1_1968"},"replace childcare1_1968 = childcare1_1968",0]
{"$rows_left_out":68}
{"sheet":"TAXSIM","index":6,"n_rows":182,"n_cols":11,"rows_kept":182,"cut":false,"hidden":false,"merged":[]}
[]
[null,"Create TAXSIM Variables (Stata Code)",null,"Comments"]
[]
[null,"****************************************************************************************************"]
[null,"* Section 4: Calculate TAXSIM Inputs"]
[null,"****************************************************************************************************"]
{"$rows_left_out":177}
{"sheet":"Inputs>","index":7,"n_rows":0,"n_cols":0,"rows_kept":0,"cut":false,"hidden":false,"merged":[]}

{"sheet":"Time Units","index":8,"n_rows":22,"n_cols":11,"rows_kept":22,"cut":false,"hidden":false,"merged":[]}
[]
[null,"PSID Name","Data Year","Description","Hour","Day","Week","2 Wks","Month","Year","Inap"]
[null,null,null,"Multiplier",".",".",".",26,12,1,0]
[null,null,null,"All Variable Codes 1996-2011",null,null,3,4,5,6,0]
[null,"CHILD CARE COST PER",1993,{"$f":"CONCATENATE(OFFSET(Variables!$E$2,MATCH('Time Units'!B5,Variables!$H$3:$H$45,0),0),\"_\",C5)","v":"childcare1_TU_1993"},1,2,3,4,5,6,0]
[null,"CHILD CARE COST PER",1994,{"$f":"CONCATENATE(OFFSET(Variables!$E$2,MATCH('Time Units'!B6,Variables!$H$3:$H$45,0),0),\"_\",C6)","v":"childcare1_TU_1994"},null,null,1,2,3,4,0]
{"$rows_left_out":17}
{"sheet":"Indicators","index":9,"n_rows":7,"n_cols":10,"rows_kept":7,"cut":false,"hidden":false,"merged":[]}
[]
[]
[]
[null,"PSID Name","Variable Name","Included?","Entry","Code 1","Code 2","Code 3","Code 4","Code 5"]
[null,"J1 MARITAL STATUS",{"$f":"INDEX(Variables!$B$2:$AT$45,MATCH($B5,Variables!$H$2:$H$45,0),MATCH(C$4,Variables!$B$2:$AT$2,0))","v":"mstat1"},{"$f":"OFFSET(Variables!$F$2,MATCH(C5,Variables!$E$3:$E$45,0),0)","v":"Y"},"Original",1,2,3,4,5]
[null,"J1 MARITAL STATUS",{"$f":"INDEX(Variables!$B$2:$AT$45,MATCH($B6,Variables!$H$2:$H$45,0),MATCH(C$4,Variables!$B$2:$AT$2,0))","v":"mstat1"},{"$f":"OFFSET(Variables!$F$2,MATCH(C6,Variables!$E$3:$E$45,0),0)","v":"Y"},"Meaning","Married","Single / Never Married","Widowed","Divorced / Annulled","Separated"]
{"$rows_left_out":2}
{"sheet":"Error Codes","index":10,"n_rows":49,"n_cols":46,"rows_kept":49,"cut":false,"hidden":false,"merged":[]}
[]
[null,"PSID Name","Variable Name","Included?",{"$f":"CONCATENATE(Cover!$C$14,\" Var?\")","v":"1968 Var?"},{"$f":"CONCATENATE(Cover!$C$14,\" Error?\")","v":"1968 Error?"},"Cumulative Count","Category Count","Action",1968,1969,1970,1971,1972,1973,1974,1975,1976,1977,1978,1979,1980,1981,1982,1983,1984,1985,1986,1987,1988,1989,1990,1991,1992,1993,1994,1995,1996,1997,1999,2001,2003,2005,2007,2009,2011]
[null,"AGE OF HEAD",{"$f":"INDEX(Variables!$B$2:$AT$45,MATCH($B3,Variables!$H$2:$H$45,0),MATCH(C$2,Variables!$B$2:$AT$2,0))","v":"age1"},{"$f":"OFFSET(Variables!$F$2,MATCH(C3,Variables!$E$3:$E$45,0),0)","v":"Y"},{"$f":"IF(INDEX(Variables!$B$2:$AT$45,MATCH('Error Codes'!$B3,Variables!$H$2:$H$45,0),MATCH(Survey_Year,Variables!$B$2:$AT$2,0))<>\"-\",\"Y\",\"N\")","v":"Y"},{"$f":"IF(D3=\"N\",0,IF(E3=\"N\",0,IF(OFFSET($I3,0,MATCH(Cover!$C$14,$J$2:$AT$2,0))>0,1,0)))","v":1},{"$f":"COUNTIF($F$3:F3,\">\"&0)","v":1},{"$f":"COUNTIFS($C$3:C3,C3,$F$3:F3,1)","v":1},"Drop",98,null,null,null,null,null,null,null,null,null,null,null,null,null,null,null,null,null,null,null,null,null,null,null,null,null,null,98,98]
[null,"AGE OF HEAD",{"$f":"INDEX(Variables!$B$2:$AT$45,MATCH($B4,Variables!$H$2:$H$45,0),MATCH(C$2,Variables!$B$2:$AT$2,0))","v":"age1"},{"$f":"OFFSET(Variables!$F$2,MATCH(C4,Variables!$E$3:$E$45,0),0)","v":"Y"},{"$f":"IF(INDEX(Variables!$B$2:$AT$45,MATCH('Error Codes'!$B4,Variables!$H$2:$H$45,0),MATCH(Survey_Year,Variables!$B$2:$AT$2,0))<>\"-\",\"Y\",\"N\")","v":"Y"},{"$f":"IF(D4=\"N\",0,IF(E4=\"N\",0,IF(OFFSET($I4,0,MATCH(Cover!$C$14,$J$2:$AT$2,0))>0,1,0)))","v":0},{"$f":"COUNTIF($F$3:F4,\">\"&0)","v":1},{"$f":"COUNTIFS($C$3:C4,C4,$F$3:F4,1)","v":1},"Drop",null,null,null,null,null,null,null,null,null,null,null,null,null,null,null,null,null,null,null,null,null,null,null,null,null,null,0,0,0]
[null,"AGE OF HEAD",{"$f":"INDEX(Variables!$B$2:$AT$45,MATCH($B5,Variables!$H$2:$H$45,0),MATCH(C$2,Variables!$B$2:$AT$2,0))","v":"age1"},{"$f":"OFFSET(Variables!$F$2,MATCH(C5,Variables!$E$3:$E$45,0),0)","v":"Y"},{"$f":"IF(INDEX(Variables!$B$2:$AT$45,MATCH('Error Codes'!$B5,Variables!$H$2:$H$45,0),MATCH(Survey_Year,Variables!$B$2:$AT$2,0))<>\"-\",\"Y\",\"N\")","v":"Y"},{"$f":"IF(D5=\"N\",0,IF(E5=\"N\",0,IF(OFFSET($I5,0,MATCH(Cover!$C$14,$J$2:$AT$2,0))>0,1,0)))","v":1},{"$f":"COUNTIF($F$3:F5,\">\"&0)","v":2},{"$f":"COUNTIFS($C$3:C5,C5,$F$3:F5,1)","v":2},"Drop",99,99,99,99,99,99,99,99,99,99,99,99,99,99,99,99,99,99,99,99,99,99,99,99,99,99,99,99,99,999,999,999,999,999,999,999,999]
[null,"AGE OF WIFE",{"$f":"INDEX(Variables!$B$2:$AT$45,MATCH($B6,Variables!$H$2:$H$45,0),MATCH(C$2,Variables!$B$2:$AT$2,0))","v":"age2"},{"$f":"OFFSET(Variables!$F$2,MATCH(C6,Variables!$E$3:$E$45,0),0)","v":"Y"},{"$f":"IF(INDEX(Variables!$B$2:$AT$45,MATCH('Error Codes'!$B6,Variables!$H$2:$H$45,0),MATCH(Survey_Year,Variables!$B$2:$AT$2,0))<>\"-\",\"Y\",\"N\")","v":"Y"},{"$f":"IF(D6=\"N\",0,IF(E6=\"N\",0,IF(OFFSET($I6,0,MATCH(Cover!$C$14,$J$2:$AT$2,0))>0,1,0)))","v":1},{"$f":"COUNTIF($F$3:F6,\">\"&0)","v":3},{"$f":"COUNTIFS($C$3:C6,C6,$F$3:F6,1)","v":1},"Drop",99,99,99,99,99,99,99,99,99,99,99,99,99,99,99,99,99,99,99,99,99,99,99,99,99,99,99,99,99,999,999,999,999,999,999,999,999]
{"$rows_left_out":44}
{"sheet":"Variables","index":11,"n_rows":45,"n_cols":46,"rows_kept":45,"cut":false,"hidden":false,"merged":[]}
[]
[null,"Category","Time Unit?","Category #","Variable Name","Included?","Description","PSID Name","PSID Description",1968,1969,1970,1971,1972,1973,1974,1975,1976,1977,1978,1979,1980,1981,1982,1983,1984,1985,1986,1987,1988,1989,1990,1991,1992,1993,1994,1995,1996,1997,1999,2001,2003,2005,2007,2009,2011]
[null,"age","N",{"$f":"IF(B3=B2,D2+1,1)","v":1},{"$f":"IF(C3=\"N\",CONCATENATE(B3,D3),CONCATENATE(E2,\"_TU\"))","v":"age1"},"Y","Head's Age","AGE OF HEAD","Age of Head of Family Unit","V117","V1008","V1239","V1942","V2542","V3095","V3508","V3921","V4436","V5350","V5850","V6462","V7067","V7658","V8352","V8961","V10419","V11606","V13011","V14114","V15130","V16631","V18049","V19349","V20651","V22406","ER2007","ER5006","ER7006","ER10009","ER13010","ER17013","ER21017","ER25017","ER36017","ER42017","ER47317"]
[null,"age","N",{"$f":"IF(B4=B3,D3+1,1)","v":2},{"$f":"IF(C4=\"N\",CONCATENATE(B4,D4),CONCATENATE(E3,\"_TU\"))","v":"age2"},"Y","Spouse's Age","AGE OF WIFE","Age of Wife of Head","V118","V1011","V1241","V1944","V2544","V3097","V3510","V3923","V4438","V5352","V5852","V6464","V7069","V7660","V8354","V8963","V10421","V11608","V13013","V14116","V15132","V16633","V18051","V19351","V20653","V22408","ER2009","ER5008","ER7008","ER10011","ER13012","ER17015","ER21019","ER25019","ER36019","ER42019","ER47319"]
[null,"childcare","N",{"$f":"IF(B5=B4,D4+1,1)","v":1},{"$f":"IF(C5=\"N\",CONCATENATE(B5,D5),CONCATENATE(E4,\"_TU\"))","v":"childcare1"},"Y","Child Care Expenses (Prior Year)","COST CHILD CARE","Cost of child care in YR-1 for families with female Head or Wives who worked in YR-1","-","-","V1164","V1865","V2465","-","-","-","V4717","V5259","-","V6387","-","-","-","-","-","V11990","-","-","V15761","V17296","V18700","V20000","V21300","V23159","ER3058","ER6057","ER8154","ER11048","ER14232","ER18362","ER21628","ER25628","ER36633","ER42652","ER47970"]
[null,"childcare","Y",2,"childcare1_TU","Y","Child Care Expenses (TU)","CHILD CARE COST PER","How much did you (and your family living there) pay for child care in YR-1?--TIME UNIT","-","-","-","-","-","-","-","-","-","-","-","-","-","-","-","-","-","-","-","-","-","-","-","-","-","-","-","-","-","-","-","-","-","-","ER36634","ER42653","ER47971"]
{"$rows_left_out":40}
{"sheet":"Lookup","index":12,"n_rows":53,"n_cols":10,"rows_kept":53,"cut":false,"hidden":false,"merged":[]}
[]
[null,"Responses",null,"State Abbv","TAXSIM Code","PSID Code",null,"Mstat1 Meaning","TAXSIM Code","PSID Code"]
[null,"Yes",null,"AL",1,1,null,"Married",2,1]
[null,"No",null,"AK",2,50,null,"Single / Never Married",1,2]
[null,null,null,"AZ",3,2,null,"Widowed",1,3]
[null,null,null,"AR",4,3,null,"Divorced / Annulled",1,4]
{"$rows_left_out":47}